program: Gaussian 09
title: 000149419
version: EM64L-G09RevD.01
frameworkgroup: C1[X(C19H14O)]
method: RPBEPBE
basis: SDD
operation: Freq
keyword: #pfreq=noraman
keyword: PBEPBE/SDD
title: #p freq=noraman PBEPBE/SDD
converged: NO YES NO YES
title: Mulliken charges:
elementType: O C C C C C C C C C C C C C C C C C C C H H H H H H H H H H H H H H
charge: -0.435046 0.133287 0.242857 0.179024 0.193557 0.423323 0.493660 0.436420 -0.803109 -0.425318 -0.546331 -0.484185 -0.339770 -0.908975 -0.443421 -0.455757 0.279149 -0.417758 -0.289762 -0.254881 0.232472 0.224459 0.237277 0.244960 0.245608 0.247807 0.234850 0.234709 0.244411 0.243116 0.222483 0.224737 0.230413 0.355733
chargesum: 0.00000
title: Mulliken charges with hydrogens summed into heavy atoms:
elementType: O C C C C C C C C C C C C C C C C C C C
charge: -0.079313 0.133287 0.242857 0.179024 0.193557 0.423323 0.493660 0.436420 -0.570637 -0.200859 -0.309054 -0.239225 -0.094162 -0.191609 -0.199009 -0.212641 0.279149 -0.195275 -0.065025 -0.024468
polarizability: 4.00489676e+02 -4.45915287e+00 2.27034716e+02 -7.78251182e-03 -1.32100601e-02 8.31501475e+01
1716.lowfreq: -23.2147 -0.0005 0.0008 0.0010 5.7515 8.6016 15.0122 62.7273 70.7413
frequency: -23.0805 62.7258 70.7175 153.5065 162.9960 197.7281 211.7631 260.2207 302.9096 311.2020 329.8084 343.8782 353.8190 379.3104 384.6689 417.0423 439.2827 451.4899 497.2335 502.8187 524.6906 538.8141 553.6411 571.3436 598.0666 606.1476 627.8078 675.5372 692.1653 706.4438 750.6869 768.4628 796.8839 797.7496 817.3569 840.1905 857.4265 861.2912 880.1046 890.6858 901.2868 934.7868 949.0197 955.2321 980.6474 984.8692 991.6844 1014.8066 1047.8752 1052.3770 1061.0893 1117.5544 1145.4017 1150.8867 1173.6266 1180.4044 1210.3056 1227.5576 1239.9285 1263.2004 1274.9448 1279.4915 1299.4276 1322.8920 1366.9223 1389.2687 1402.0512 1408.3582 1420.6840 1426.8024 1446.9716 1450.9669 1490.9970 1491.7335 1502.8212 1528.4958 1535.1072 1576.3284 1605.5297 1617.7601 1630.3775 1642.6736 2973.7716 3056.6613 3073.8355 3112.8508 3115.0327 3120.7154 3128.4539 3133.3539 3141.9926 3158.7638 3171.1017 3187.2460 3267.7808 3587.6652
redmass: 3.5213 4.4854 4.1867 4.0978 5.7840 4.1832 4.1626 6.2017 4.2521 3.7187 1.1318 4.8857 1.6803 2.4689 5.7922 2.1830 4.2925 2.9774 5.4784 2.9425 2.9672 5.7152 4.8450 7.1733 3.1013 5.3564 3.3950 5.8340 6.6136 3.6633 1.5268 1.7057 6.6991 1.4779 1.6148 4.7165 1.7326 4.9810 1.7264 1.9179 1.9038 4.6671 1.4649 1.3810 1.3902 4.7988 1.3804 2.0886 2.0650 1.6100 2.2780 2.3189 1.4868 1.3435 1.2867 1.1740 1.8010 1.4085 2.6096 1.6613 1.9869 2.8493 1.9158 2.9790 4.2041 3.5970 1.5690 2.1753 2.5263 3.6553 3.2400 2.6825 1.0501 2.3375 1.4092 3.3081 3.8128 8.1876 5.8812 5.9886 6.9515 6.4001 1.0372 1.0986 1.0976 1.0906 1.0877 1.0867 1.0891 1.0909 1.0971 1.0996 1.0946 1.0888 1.0886 1.0661
irintensity: 0.0057 0.0053 1.6354 3.0324 1.8835 2.3257 1.4810 1.1177 1.0014 1.2672 138.2274 4.3351 9.3891 0.1895 2.3017 0.0985 4.0841 6.8602 0.3101 4.3048 2.7979 9.5955 8.6388 0.0469 12.4901 6.2786 1.0366 0.5620 1.8670 10.0424 4.5515 79.0018 25.8270 18.6370 6.2815 13.4805 39.7098 1.5252 1.1766 35.2527 10.5581 32.6742 6.0666 2.7670 0.4680 0.7663 0.8785 28.5444 2.5709 8.3615 8.2987 9.6766 48.3009 224.4533 8.7251 4.8638 1.5220 9.0519 46.2011 2.9811 4.8550 19.1827 9.0456 10.9042 19.6940 2.4734 5.6454 8.3062 7.4596 4.1933 3.0035 6.5086 13.8265 84.2670 21.5641 19.3574 1.0705 3.5646 47.1317 3.2073 0.0146 89.1564 37.8654 16.1658 26.8645 16.3681 17.9180 1.1063 5.1245 24.1416 28.9476 45.3493 8.1857 12.6417 9.2362 65.4592
temp: 298.150 k
press: 1.00000 atm
elementType: 8 6 6 6 6 6 6 6 6 6 6 6 6 6 6 6 6 6 6 6 1 1 1 1 1 1 1 1 1 1 1 1 1 1
symmnumber: 1
zpe: 706460.6 jmol-1
zpe.correction: 0.269077 hartree
zpe.thermalcorrener: 0.283243 hartree
zpe.thermalcorrenthalpy: 0.284187 hartree
zpe.thermalcorrgfe: 0.228972 hartree
zpe.sumelectzpe: -806.326751 hartree
zpe.sumelectthermal: -806.312584 hartree
zpe.sumelectthermalent: -806.311640 hartree
zpe.sumelectthermalfe: -806.366856 hartree
dipole: -1.0943 1.5986 -0.0009
dipole: 1.9373
quadrupole: -87.2727 -104.3923 -124.4958
quadrupole: -4.9725 0.0014 -0.0032
quadrupole: 18.1142 0.9946 -19.1089 -4.9725 0.0014 -0.0032
hfenergy: -806.5958274 hartree
pointgroup: C01 [X(C19H14O1)]
dipole: 0.4466296 0.6176123 0.0003586 debye
polarizability: 400.604232|-0.0251283|226.9201605|-0.0074387|0.0134067|83.1501475 unknown
InChI: InChI=1S/C19H14O/c1-12-10-14-6-8-15(20)11-18(14)17-9-7-13-4-2-3-5-16(13)19(12)17/h2-11,20H,1H3
charge 0 multiplicity 1
34 atoms
O  4.976807 -1.990656 0.000463
C  -0.723855 0.547609 -0.000308
C  0.262016 -0.514575 -0.00039
C  1.698721 -0.234754 -0.000205
C  -2.152998 0.165851 0.000049
C  -0.232197 1.932561 -0.000528
C  2.130689 1.136529 -0.000155
C  -2.517953 -1.240212 -0.000372
C  1.141575 2.168119 -0.000386
C  -0.163325 -1.890546 -0.000642
C  -1.495197 -2.245921 -0.000778
C  2.701001 -1.253522 -0.000006
C  -3.256193 1.087416 0.001055
C  -1.092592 3.190837 -0.000955
C  3.52565 1.448675 0.000029
C  -3.888569 -1.649199 -0.000246
C  4.060704 -0.921964 0.000186
C  4.48983 0.440069 0.000229
C  -4.59334 0.66737 0.001208
C  -4.925449 -0.714856 0.000466
H  1.494906 3.206939 -0.000518
H  0.587748 -2.683282 -0.000764
H  -1.791707 -3.301154 -0.001048
H  2.453343 -2.316562 0.000059
H  -3.084626 2.157815 0.001887
H  -0.438481 4.079318 -0.001273
H  -1.736596 3.264539 -0.89658
H  -1.736611 3.265172 0.894633
H  3.833062 2.500664 0.00006
H  -4.108259 -2.723544 -0.00064
H  5.559582 0.685963 0.000453
H  -5.389344 1.420548 0.001947
H  -5.972301 -1.036613 0.000589
H  5.907861 -1.657436 0.000779
