program: Gaussian 09
title: 000149446
version: EM64L-G09RevD.01
frameworkgroup: C1[X(C17H20N6O3)]
method: RPBEPBE
basis: SDD
operation: Freq
keyword: #p
keyword: freq=noraman
keyword: PBEPBE/SDD
title: #p freq=noraman PBEPBE/SDD
converged: YES YES NO NO
title: Mulliken charges:
elementType: O O O N N N N N N C C C C C C C C C C C C C C C C C H H H H H H H H H H H H H H H H H H H H
charge: -0.246000 -0.209176 -0.218286 -0.094147 -0.203074 -0.117288 -0.180945 -0.103179 0.042515 -0.363935 -0.424080 -0.334421 -0.350305 -0.317290 -0.313641 0.289104 0.160798 0.024420 0.143620 -0.359361 -0.335396 -0.224490 0.307038 -0.226121 -0.641322 -0.363095 0.204366 0.255284 0.278604 0.225400 0.199547 0.194049 0.219572 0.193900 0.193517 0.215169 0.216353 0.194224 0.239476 0.253170 0.228570 0.231835 0.251857 0.257144 0.312125 0.293896
chargesum: 0.00000
title: Mulliken charges with hydrogens summed into heavy atoms:
elementType: O O O N N N N N N C C C C C C C C C C C C C C C C C
charge: -0.246000 -0.209176 -0.218286 -0.094147 -0.203074 -0.117288 -0.180945 -0.103179 0.042515 0.095714 0.079924 0.059175 0.063167 0.091396 0.096936 0.289104 0.160798 0.024420 0.143620 -0.119885 -0.082226 0.004079 0.307038 0.005714 0.179803 -0.069199
polarizability: 3.43240217e+02 7.32939508e+01 3.63165927e+02 -1.21447061e+01 7.77295247e+00 1.26677880e+02
1716.lowfreq: -16.3334 -5.3501 -0.0009 -0.0007 -0.0007 3.0591 8.6707 16.4946 23.2078
frequency: -12.0550 16.3268 23.1346 43.2940 52.3021 59.8275 73.8756 82.7008 96.7008 122.8416 164.2709 181.6740 205.0295 225.4985 233.9817 240.3079 241.5297 251.6418 291.2813 302.4264 325.2432 332.0763 357.6979 373.2433 385.0451 398.5038 441.4584 449.4761 458.2449 468.0001 526.2193 567.3401 577.0185 589.3930 592.2780 608.8686 627.6775 666.9646 677.7915 687.7578 731.9522 733.2780 751.7008 754.4734 760.3426 766.8171 789.9145 810.1282 816.6589 840.5050 854.6770 877.7807 886.3556 896.7075 915.4167 940.7763 980.5190 998.4063 1005.9334 1026.5941 1039.1594 1049.0457 1051.8914 1075.0496 1088.9394 1100.2084 1109.0697 1112.3074 1131.9665 1137.1896 1141.4464 1156.8955 1166.8076 1178.2568 1188.8579 1207.2193 1212.7659 1236.6839 1254.6402 1270.5433 1277.1115 1292.5797 1295.5226 1299.7575 1312.7063 1317.9406 1323.1416 1331.7484 1336.8383 1343.1269 1347.5066 1359.7921 1364.6211 1370.3230 1386.7541 1390.5098 1410.1264 1441.2085 1441.6678 1446.4256 1449.8555 1457.7447 1459.3789 1463.2725 1472.1584 1477.1554 1479.6292 1480.1323 1494.3829 1552.1302 1594.7569 1621.4943 2864.9951 2872.7423 2887.9176 2955.6001 2960.8564 3009.9387 3018.8422 3026.9352 3036.4555 3056.0598 3081.4795 3085.4326 3120.9197 3123.5276 3124.1920 3134.3941 3146.7065 3160.5727 3174.4552 3255.0898
redmass: 3.7475 4.8584 4.7661 7.5400 5.6376 5.6530 4.2362 5.6090 4.4267 6.0706 5.5683 1.0654 3.1944 5.6966 1.8308 4.6899 5.6501 6.2135 2.9714 3.1042 4.2947 2.9409 3.8981 4.3646 3.0233 2.5858 3.9654 8.7882 4.6061 2.8410 5.4183 4.9008 3.4422 4.0604 4.7587 3.3594 4.0995 8.0719 6.1012 7.5611 6.3542 6.1612 12.2453 1.4541 1.7156 3.4376 3.4444 4.0620 2.8248 1.6040 1.4849 1.4079 5.1968 2.6124 4.2308 1.3731 1.3111 2.7726 2.0559 2.2183 3.6330 2.5475 1.8975 3.3759 3.4740 2.2568 3.1456 2.2002 1.3068 1.8725 2.2743 2.1472 1.2044 2.6247 1.0726 4.3233 1.8800 1.8885 2.3288 1.3191 1.7449 1.4597 1.4639 2.5006 3.0737 1.8719 3.5981 1.4535 1.7116 4.2596 1.5845 1.8139 2.1161 1.2641 2.1188 1.6415 4.4345 2.8300 1.0885 1.0829 1.0977 1.1836 1.2887 1.2621 1.7415 2.4819 1.1030 2.1267 1.0659 8.3435 7.7455 7.6399 1.0702 1.0696 1.0698 1.0663 1.0663 1.0328 1.0877 1.0683 1.0908 1.0879 1.0965 1.0982 1.1019 1.0991 1.1054 1.0857 1.0902 1.0957 1.0995 1.0996
irintensity: 0.1717 0.3048 0.2740 0.4407 0.4025 2.9331 1.0919 1.1936 0.8488 4.1178 3.9989 0.2018 8.4080 1.1614 1.7336 1.1757 0.5706 0.2060 4.0766 10.0775 8.7076 3.8167 3.3074 4.3512 0.8609 2.6893 9.6670 2.6612 6.2015 1.4491 1.1108 0.2394 1.8184 3.0694 0.2724 2.7724 3.6206 2.7841 4.3693 10.1594 1.9788 6.0190 16.8361 100.3359 14.9434 6.3162 0.3977 29.6526 1.3463 0.2377 0.6290 22.2894 5.7156 8.2370 2.8374 1.9278 0.0902 32.3639 9.8484 10.4625 5.9793 14.2374 15.4869 9.1073 37.1099 4.8173 57.5151 3.2943 0.2831 10.9944 91.0904 47.0053 19.9136 142.8066 1.8987 179.0284 77.2082 38.0353 32.5835 5.3499 18.7753 76.0445 48.8216 134.8815 47.5352 16.1658 32.9636 42.3518 51.6698 69.0387 16.5854 22.2845 64.3736 4.2437 25.6408 8.8880 46.8943 17.1086 3.2794 3.8314 23.6274 67.3422 60.3754 5.8082 11.8152 18.6735 13.3723 57.1123 17.0081 20.6044 28.9402 3.5152 45.3411 61.6209 120.4620 37.4251 88.9642 33.5229 44.2915 35.1513 26.7944 16.0548 36.1551 37.6237 8.2935 0.5885 15.1037 0.0361 10.8575 22.3815 27.4321 2.5853
temp: 298.150 k
press: 1.00000 atm
elementType: 8 8 8 7 7 7 7 7 7 6 6 6 6 6 6 6 6 6 6 6 6 6 6 6 6 6 1 1 1 1 1 1 1 1 1 1 1 1 1 1 1 1 1 1 1 1
symmnumber: 1
zpe: 952559.0 jmol-1
zpe.correction: 0.362811 hartree
zpe.thermalcorrener: 0.384754 hartree
zpe.thermalcorrenthalpy: 0.385698 hartree
zpe.thermalcorrgfe: 0.309625 hartree
zpe.sumelectzpe: -1211.975945 hartree
zpe.sumelectthermal: -1211.954002 hartree
zpe.sumelectthermalent: -1211.953057 hartree
zpe.sumelectthermalfe: -1212.029130 hartree
dipole: 3.6715 4.0252 -0.4562
dipole: 5.4672
quadrupole: -185.0747 -153.0453 -152.1118
quadrupole: -6.0900 -3.2883 -1.0835
quadrupole: -21.6641 10.3653 11.2988 -6.0900 -3.2883 -1.0835
hfenergy: -1212.3387553 hartree
pointgroup: C01 [X(C17H20N6O3)]
dipole: -1.6675294 1.3119537 0.3531915 debye
polarizability: 365.6208667|-70.8899346|339.6297004|-20.579963|17.9481873|127.8334578 unknown
InChI: InChI=1S/C17H20N6O3/c1-20-15(23(24)25)12-18-16(20)17-19-13-4-2-3-5-14(13)22(17)7-6-21-8-10-26-11-9-21/h2-5,12H,6-11H2,1H3
charge 0 multiplicity 1
46 atoms
O  -5.150296 -3.631868 -0.445909
O  5.201201 -3.064745 -0.18052
O  5.961059 -0.905796 -0.027599
N  -2.839788 -1.900235 -0.165304
N  -0.453639 0.944764 0.623357
N  1.30951 2.358487 0.187466
N  3.215233 -0.018389 0.161617
N  1.3748 -1.381746 0.149143
N  5.00603 -1.787765 -0.061327
C  -1.870484 -0.825892 -0.460566
C  -1.276605 -0.261359 0.854313
C  -4.211185 -1.403407 0.111917
C  -2.870883 -2.980051 -1.185539
C  -5.108956 -2.566337 0.56805
C  -3.78402 -4.120032 -0.705731
C  -0.968756 2.249115 0.621142
C  0.927147 1.063577 0.344685
C  0.145236 3.116905 0.355934
C  1.82074 -0.07955 0.226252
C  -2.273529 2.746818 0.833546
C  -0.038602 4.519653 0.297484
C  -2.436406 4.14508 0.773509
C  3.644973 -1.353086 0.040524
C  -1.33655 5.019294 0.509476
C  4.070661 1.192902 0.22279
C  2.497012 -2.165116 0.036836
H  -2.323748 0.002474 -1.058225
H  -1.035344 -1.246426 -1.047511
H  -0.65848 -1.042263 1.317482
H  -2.081114 0.017178 1.558208
H  -4.660462 -0.92694 -0.796076
H  -4.175388 -0.639852 0.912655
H  -1.844361 -3.365538 -1.328249
H  -3.244133 -2.60722 -2.171911
H  -4.72555 -2.975154 1.527819
H  -6.15404 -2.238013 0.693559
H  -3.891524 -4.898524 -1.478798
H  -3.364474 -4.566129 0.221547
H  -3.126023 2.089195 1.030878
H  0.808492 5.181198 0.094155
H  -3.431746 4.575005 0.929975
H  -1.514167 6.099229 0.47152
H  4.732209 1.136471 1.101065
H  4.701403 1.245751 -0.677522
H  3.402227 2.064191 0.274853
H  2.45772 -3.247551 -0.042271
