program: Gaussian 09
title: 000149414
version: EM64L-G09RevD.01
frameworkgroup: C1[X(C10H15NO)]
method: RPBEPBE
basis: SDD
operation: Freq
keyword: #p
keyword: freq=noraman
keyword: PBEPBE/SDD
title: #p freq=noraman PBEPBE/SDD
converged: NO YES NO NO
title: Mulliken charges:
elementType: O N C C C C C C C C C C H H H H H H H H H H H H H H H
charge: -0.444100 -0.115049 -0.298669 0.442722 -0.580823 -0.390041 -0.340929 -0.681298 0.445552 -0.379700 -0.403270 -0.806274 0.233294 0.195904 0.267117 0.199686 0.251095 0.316903 0.227860 0.210286 0.224128 0.269607 0.234273 0.231484 0.224713 0.228058 0.237470
chargesum: 0.00000
title: Mulliken charges with hydrogens summed into heavy atoms:
elementType: O N C C C C C C C C C C
charge: -0.444100 -0.115049 0.130529 0.442722 0.137075 -0.073137 -0.113069 0.022724 0.445552 -0.145427 -0.171786 -0.116034
polarizability: 1.55165320e+02 4.24966203e+00 1.00404584e+02 -2.71795460e+00 1.51277255e+01 9.99621151e+01
1716.lowfreq: -17.9204 0.0003 0.0004 0.0005 3.4998 12.3757 54.9551 58.3970 70.2990
frequency: 54.6611 57.6789 70.2590 121.7493 186.4732 206.3942 219.8318 244.1305 250.7457 320.9489 344.2359 362.1395 376.2163 414.9515 460.4325 474.8900 508.7852 565.2131 619.0120 631.7269 720.7648 771.5103 789.7678 816.8037 838.4400 855.4061 866.3095 942.1128 952.7693 986.2028 997.8521 1006.8342 1009.3319 1047.6725 1061.8367 1091.7045 1107.8257 1116.8575 1153.6610 1174.3025 1190.0519 1218.2850 1281.0172 1291.2295 1339.0258 1376.3016 1382.5673 1396.3647 1398.2245 1408.4753 1439.1689 1455.5253 1458.8320 1462.6044 1473.6288 1476.0219 1485.7492 1491.7977 1598.4492 1614.2301 2976.5503 2993.3329 2996.3266 3006.3090 3057.9037 3079.4617 3086.9192 3095.4192 3110.0939 3117.2981 3120.9827 3126.7194 3144.7790 3154.1350 3155.7649
redmass: 1.0507 3.2050 3.1238 2.5253 1.6898 2.9506 1.5563 1.1654 2.5361 3.8993 3.3361 3.6010 3.1841 2.9457 3.4662 3.0934 3.9066 3.0022 4.3344 6.9098 3.1937 2.2570 2.9355 1.4289 1.6165 2.6522 1.6447 1.9354 1.7128 1.4003 1.3294 2.6983 2.4062 1.5642 1.8487 1.3981 2.2730 1.6676 1.6952 1.2983 1.7746 2.6958 1.2100 1.2963 1.2852 1.2621 5.4293 3.2232 1.2270 1.1749 1.0548 1.0766 1.0564 1.0504 1.1046 1.0561 2.4500 1.0646 6.8754 6.6552 1.0388 1.0367 1.0375 1.0569 1.0948 1.1010 1.0998 1.0993 1.1014 1.0956 1.0892 1.0897 1.0957 1.1038 1.0942
irintensity: 0.5564 1.6808 0.0758 0.4604 5.0467 5.2306 8.8931 0.2425 1.2435 5.3565 7.8875 5.0084 6.1691 0.0615 4.0101 3.1261 7.7018 30.3828 1.3635 1.2843 2.4226 8.1519 1.5533 28.3401 8.1145 15.5123 15.9834 3.4177 4.6846 1.0718 8.1544 3.2465 18.4510 17.6416 11.1343 15.2569 0.8493 13.6633 3.1053 9.8270 0.7358 0.7223 3.9721 1.7547 7.0472 37.2574 1.1033 3.4520 11.7051 9.5575 7.3629 11.2903 2.3303 24.3665 14.1135 13.0593 40.1919 16.5774 5.3929 0.8922 33.7748 16.4135 25.9391 48.5528 22.6491 4.0618 17.2445 34.7078 12.0247 29.8572 2.7073 19.0542 14.9442 8.1671 24.9850
temp: 298.150 k
press: 1.00000 atm
elementType: 8 7 6 6 6 6 6 6 6 6 6 6 1 1 1 1 1 1 1 1 1 1 1 1 1 1 1
symmnumber: 1
zpe: 599675.9 jmol-1
zpe.correction: 0.228405 hartree
zpe.thermalcorrener: 0.241045 hartree
zpe.thermalcorrenthalpy: 0.241989 hartree
zpe.thermalcorrgfe: 0.189695 hartree
zpe.sumelectzpe: -519.035154 hartree
zpe.sumelectthermal: -519.022514 hartree
zpe.sumelectthermalent: -519.021570 hartree
zpe.sumelectthermalfe: -519.073864 hartree
dipole: -1.9798 2.5276 3.0770
dipole: 4.4471
quadrupole: -67.9343 -70.5700 -75.1314
quadrupole: 6.9974 7.1201 0.3677
quadrupole: 3.2776 0.6419 -3.9195 6.9974 7.1201 0.3677
hfenergy: -519.2635587 hartree
pointgroup: C01 [X(C10H15N1O1)]
dipole: -0.7812523 1.2861176 0.8925985 debye
polarizability: 155.2953856|2.8680986|108.0823112|-2.8433536|12.9400194|92.1543225 unknown
InChI: InChI=1S/C10H15NO/c1-4-11(3,12)10-7-5-9(2)6-8-10/h5-8H,4H2,1-3H3
charge 0 multiplicity 1
27 atoms
O  2.246859 -0.997775 -1.061894
N  1.778963 0.144437 -0.348924
C  2.458545 0.181966 1.050268
C  0.255282 0.129905 -0.188162
C  2.181771 1.388802 -1.1356
C  -0.429087 -0.955339 -0.757226
C  -0.43502 1.160319 0.483245
C  2.181032 -1.104142 1.826642
C  -2.564777 0.00056 0.027308
C  -1.835514 -1.01258 -0.647328
C  -1.842506 1.087718 0.585654
C  -4.074613 -0.086503 0.169959
H  3.533116 0.275529 0.819759
H  2.116074 1.084232 1.591428
H  1.677503 1.326161 -2.109972
H  1.902995 2.319929 -0.610029
H  3.270309 1.325521 -1.278705
H  0.183319 -1.708041 -1.264958
H  0.093733 2.014385 0.921697
H  2.81649 -1.139204 2.72952
H  1.125335 -1.178495 2.140083
H  2.425075 -1.959381 1.174244
H  -2.376259 -1.856728 -1.092156
H  -2.386045 1.886553 1.104457
H  -4.53671 0.914422 0.232678
H  -4.530685 -0.620936 -0.681737
H  -4.354888 -0.635915 1.089751
