program: Gaussian 09
title: 000149413
version: EM64L-G09RevD.01
frameworkgroup: C1[X(C9H12ClNO)]
method: RPBEPBE
basis: SDD
operation: Freq
keyword: #p
keyword: freq=noraman
keyword: PBEPBE/SDD
title: #p freq=noraman PBEPBE/SDD
converged: NO YES NO NO
title: Mulliken charges:
elementType: Cl O N C C C C C C C C C H H H H H H H H H H H H
charge: -0.051829 -0.438838 -0.118755 -0.299440 0.452401 -0.578720 -0.679283 -0.325683 -0.372948 -0.217346 -0.202791 -0.113083 0.237296 0.196797 0.201033 0.255056 0.268276 0.214570 0.223074 0.270374 0.237208 0.324849 0.257261 0.260521
chargesum: 0.00000
title: Mulliken charges with hydrogens summed into heavy atoms:
elementType: Cl O N C C C C C C C C C
charge: -0.051829 -0.438838 -0.118755 0.134652 0.452401 0.145645 0.028736 -0.088474 -0.048099 0.039915 0.057730 -0.113083
polarizability: 1.64637717e+02 3.91152519e+00 9.45941848e+01 -2.85110326e+00 1.58465283e+01 9.21499704e+01
1716.lowfreq: -24.7278 -9.0294 -1.8727 -0.0025 -0.0013 0.0009 50.9696 62.2761 113.2706
frequency: 50.1521 62.2587 113.2632 169.1754 189.0418 213.2684 238.5766 243.4085 291.1689 306.9744 356.3956 371.7104 415.8013 447.7228 460.1406 475.3312 548.0931 563.2304 619.5875 706.9737 715.3549 775.4342 811.2950 834.7030 847.0271 861.2297 938.0341 948.2908 991.0373 995.5572 1007.1087 1039.0811 1073.4578 1091.6149 1104.2649 1110.4066 1153.0935 1163.2485 1188.2254 1270.6146 1283.2671 1338.9945 1376.4480 1381.1159 1384.6266 1409.6864 1439.7899 1453.3215 1456.8223 1460.9845 1463.3838 1490.9681 1582.8750 1602.5252 2994.7895 2997.7363 3008.2441 3081.4164 3097.2537 3111.3128 3119.8794 3143.2877 3148.2496 3155.8654 3170.8806 3173.6433
redmass: 3.9324 4.0391 2.8714 3.1106 2.3190 1.5331 3.6876 1.0974 4.2357 5.5954 4.2396 3.3632 2.9844 4.3822 4.3198 3.6944 3.5414 3.4955 7.1052 5.0054 4.2338 1.8648 1.3833 1.5348 1.6942 3.1071 1.6802 2.0142 1.3212 4.4217 2.2787 1.5323 3.4497 1.3850 2.0174 2.0374 1.6753 1.2080 1.8649 1.2506 1.1999 1.2866 1.3082 2.8734 10.2144 1.1730 1.0550 1.5690 1.2029 1.1772 1.0550 1.0534 6.5310 8.4235 1.0365 1.0376 1.0575 1.1008 1.0993 1.1015 1.0976 1.0886 1.0893 1.1044 1.0951 1.0963
irintensity: 0.5662 0.5245 1.9760 6.6400 0.7371 6.1869 3.3402 0.3167 2.1957 8.2687 2.6424 7.5903 0.0101 20.4324 9.8047 10.8806 8.8219 26.9865 1.5796 17.5617 10.0690 7.5006 24.5390 7.5291 30.9752 21.5943 2.8729 5.8877 7.5829 43.8583 11.0929 6.0260 29.5371 20.2486 4.1954 7.5977 3.4291 6.7501 2.3820 3.9212 3.4630 7.5493 37.5046 8.1645 1.4938 9.4239 7.3897 31.7525 52.8788 17.6755 29.8400 12.5421 15.0835 1.0031 15.2023 23.4711 46.8818 4.2209 32.1483 11.5843 17.7833 6.2638 19.3520 13.0376 5.9210 3.9466
temp: 298.150 k
press: 1.00000 atm
elementType: 17 8 7 6 6 6 6 6 6 6 6 6 1 1 1 1 1 1 1 1 1 1 1 1
symmnumber: 1
zpe: 502962.2 jmol-1
zpe.correction: 0.191568 hartree
zpe.thermalcorrener: 0.203673 hartree
zpe.thermalcorrenthalpy: 0.204617 hartree
zpe.thermalcorrgfe: 0.153208 hartree
zpe.sumelectzpe: -939.195441 hartree
zpe.sumelectthermal: -939.183336 hartree
zpe.sumelectthermalent: -939.182392 hartree
zpe.sumelectthermalfe: -939.233801 hartree
dipole: 0.8617 2.8532 2.7918
dipole: 4.0838
quadrupole: -85.9561 -74.8758 -79.4045
quadrupole: 7.5396 8.6170 0.9987
quadrupole: -5.8773 5.2030 0.6743 7.5396 8.6170 0.9987
hfenergy: -939.3870089 hartree
pointgroup: C01 [X(C9H12Cl1N1O1)]
dipole: -0.3379005 1.3400678 -0.8194804 debye
dipolederiv: -0.8969305 0.031755 0.0471774 0.0320953 -0.1093481 0.0219712 0.0650216 0.0212315 -0.0865961 -0.6856694 -0.0557339 0.0341037 0.0447868 -0.5003702 -0.0550229 -0.0215653 -0.0040861 -0.5698948 0.1775865 0.0980042 -0.0610822 0.1243229 0.2011123 -0.0734099 -0.0633232 -0.11235 0.1533535 0.1332147 0.058797 0.0838516 0.0841339 0.1343193 0.0584716 0.2037557 0.0740969 0.2304215 0.2838161 -0.0628227 0.0332779 -0.2185712 -0.0806882 0.0007351 0.0787912 -0.0195939 -0.1202654 -0.0124567 -0.0240975 -0.0598257 -0.0800304 0.1069197 0.0246143 -0.103018 0.0003324 0.0942431 0.056961 -0.015155 -0.0108376 0.0104149 -0.0942787 -0.0196924 -0.0394263 -0.0922388 -0.0986799 -0.0630524 -0.0552261 0.0207475 0.0685784 -0.0165373 -0.0686669 -0.054381 -0.062077 -0.0821253 -0.0557042 0.0813719 -0.0578128 -0.0389064 -0.0493638 -0.0273687 0.0154116 -0.0310962 -0.0908634 -0.3189222 0.0625187 -0.0228596 0.0388737 -0.0422089 -0.0421899 -0.0005433 -0.0449656 -0.0809273 -0.3015768 -0.0971301 0.076446 -0.0648965 0.0108794 -0.0599041 0.057971 -0.0557241 -0.0670047 1.3089739 -0.0475641 -0.0931017 -0.0524583 0.081148 -0.0843375 -0.1067721 -0.0826417 -0.0060503 -0.1255667 0.0537122 0.0146538 0.0189118 0.0640351 -0.0228203 0.0397959 -0.0330819 0.0335177 0.0774697 -0.0864029 0.0114895 -0.059476 -0.1267777 0.0682945 -0.0240877 0.0565041 -0.0514596 0.1074915 -0.0488334 0.0551835 -0.0153196 -0.1399059 0.0277815 0.0417917 0.0939246 0.004039 -0.1110046 0.0321764 0.0265489 -0.0184496 0.0911514 -0.0065457 0.0088534 -0.0043145 0.1148007 0.0823206 -0.009213 -0.0876223 -0.0023384 0.079373 0.0181918 -0.0853561 -0.0278056 -0.0217309 0.0007132 -0.0008714 -0.126917 0.0132808 0.0987656 -0.0228049 -0.1399433 -0.04009 -0.0794653 -0.1122541 0.0317487 0.0893944 0.0095821 0.0605326 -0.0017538 0.0783671 -0.0037574 0.0879665 0.1001314 -0.0019864 0.0203128 -0.0087925 0.0092144 0.0335088 0.0822923 0.1351704 0.1419149 0.0263057 0.0939649 -0.0386797 0.0899912 0.0251156 0.064822 -0.0390648 0.0625586 0.1062029 0.2582056 -0.0453515 0.0300271 0.0114622 0.1098456 0.0255782 -0.0123521 0.0297449 0.151365 0.0333406 -0.0518817 0.0413524 -0.0480819 0.0460305 0.0742639 0.0418513 0.0756306 0.1143951 0.0366072 0.0582208 -0.0258277 0.0608867 0.0410361 0.0662841 -0.0240697 0.0646286 0.1228429 unknown
polarizability: 164.6847114|-2.9667951|101.4019311|-3.2395325|-13.7306656|85.2952297 unknown
InChI: InChI=1S/C9H12ClNO/c1-3-11(2,12)9-6-4-8(10)5-7-9/h4-7H,3H2,1-2H3
charge 0 multiplicity 1
24 atoms
Cl 4.326495 -0.076105 -0.14469
O  -2.243002 -0.990792 1.068626
N  -1.784172 0.147419 0.345087
C  -2.46252 0.166629 -1.05594
C  -0.261551 0.136592 0.187433
C  -2.193172 1.397925 1.120052
C  -2.174347 -1.123004 -1.822116
C  0.42743 1.162594 -0.493106
C  0.41656 -0.946629 0.76989
C  1.835713 1.097994 -0.596248
C  1.824046 -1.01718 0.67187
C  2.508677 0.006734 -0.010598
H  -3.537401 0.252844 -0.825258
H  -2.129098 1.068135 -1.603871
H  -1.922167 2.325306 0.584204
H  -3.28095 1.328945 1.264352
H  -1.688588 1.348998 2.09503
H  -2.810959 -1.169334 -2.723393
H  -1.119411 -1.192045 -2.13934
H  -2.411403 -1.976973 -1.165776
H  -0.098694 2.009964 -0.945415
H  -0.201545 -1.694453 1.278509
H  2.394687 1.878948 -1.119237
H  2.374675 -1.851013 1.116335
