program: Gaussian 09
title: 000149479
version: EM64L-G09RevD.01
frameworkgroup: C1[X(C23H28N4O)]
method: RPBEPBE
basis: SDD
operation: Freq
keyword: #p
keyword: freq=noraman
keyword: PBEPBE/SDD
title: #p freq=noraman PBEPBE/SDD
converged: YES YES NO NO
title: Mulliken charges:
elementType: O N N N N C C C C C C C C C C C C C C C C C C C C C C C H H H H H H H H H H H H H H H H H H H H H H H H H H H H
charge: -0.438245 -0.475490 -0.108993 -0.388857 -0.073369 0.206792 -0.020242 0.231281 0.250232 0.355337 0.217005 -0.651423 0.208795 -0.421377 -0.342378 -0.336680 0.002585 -0.832329 -0.364226 -0.561473 -0.314390 -0.315919 -0.348810 -0.386424 0.270919 -0.348748 -0.675729 -0.666224 0.200884 0.204849 0.179334 0.189290 0.208749 0.300315 0.271321 0.212659 0.288886 0.244757 0.244945 0.205225 0.184226 0.200503 0.179588 0.199203 0.235503 0.223913 0.235101 0.227133 0.250200 0.227819 0.209467 0.203728 0.238168 0.212829 0.199394 0.350389
chargesum: 0.00000
title: Mulliken charges with hydrogens summed into heavy atoms:
elementType: O N N N N C C C C C C C C C C C C C C C C C C C C C C C
charge: -0.087855 -0.175175 -0.108993 -0.099971 -0.073369 0.206792 -0.020242 0.231281 0.250232 0.355337 0.217005 -0.450539 0.208795 -0.037194 0.055660 0.147300 0.002585 -0.137401 -0.128723 -0.337561 0.070339 0.062872 -0.113710 -0.159290 0.270919 -0.098548 -0.034714 -0.015833
polarizability: 4.43833948e+02 4.79374795e+01 3.41974450e+02 -4.64439737e+01 1.89092895e+01 1.75860956e+02
1716.lowfreq: -2.9151 -1.4854 0.0004 0.0006 0.0009 0.9959 11.6000 13.6715 21.4729
frequency: 11.2618 13.5101 21.3258 43.4262 48.4647 59.7346 73.1065 76.0579 85.0302 93.0680 114.0932 134.5686 155.3582 171.9115 183.0718 187.6047 204.8818 219.6739 224.1853 270.0060 277.6945 284.3911 290.1048 306.4215 311.1732 318.1128 328.7728 351.5339 359.0466 380.7093 389.5950 420.6293 429.9113 434.6327 447.3911 453.3039 463.4653 471.8273 501.0802 508.7772 526.2106 547.6996 571.2226 598.4833 605.0508 613.4310 645.2058 687.0536 701.1214 728.3726 741.0559 764.7302 765.7435 780.2089 786.3441 795.9074 808.7655 816.4556 817.5808 824.3634 840.9965 859.1189 861.8746 869.6580 874.7272 903.3143 930.9148 932.0277 945.8767 960.8822 967.4705 1000.0596 1033.2661 1038.3600 1055.2760 1073.2331 1074.2938 1075.6587 1084.9634 1093.4733 1097.3899 1109.9789 1114.8715 1120.5208 1146.8749 1166.9021 1188.8518 1202.4314 1211.1189 1220.9402 1235.0078 1249.7359 1255.4177 1270.0111 1276.8483 1283.2525 1290.2153 1294.6238 1311.7450 1317.4221 1333.8609 1341.1549 1346.5028 1359.7226 1364.9748 1373.0139 1376.5958 1386.5620 1392.3368 1401.6474 1408.6413 1429.3367 1433.1097 1440.7333 1455.3934 1459.3482 1462.8199 1467.2317 1470.0069 1473.4281 1475.4409 1477.0516 1479.7983 1481.7510 1485.2932 1486.7749 1490.7393 1493.4141 1525.7963 1565.6127 1594.8810 1608.4541 1633.1055 1646.3288 2840.0580 2846.6007 2864.9142 2950.5456 2963.1173 2973.7588 2982.3486 2984.1201 3019.3643 3026.5226 3031.2161 3046.6213 3049.1031 3073.5723 3074.7126 3075.1650 3087.3814 3090.6871 3094.9864 3116.9841 3123.1397 3125.0383 3141.3022 3171.3895 3175.0579 3570.9367 3587.0007 3621.5336
redmass: 4.1825 4.2109 3.6305 4.4888 3.2843 3.7078 2.7790 2.1904 2.6952 3.0851 1.2338 3.1421 3.7626 3.3642 5.4639 1.7588 1.6254 1.9590 2.3632 3.7197 3.6118 2.1548 1.8544 3.7435 4.0783 1.1780 2.7161 3.5506 5.3916 2.1078 6.5586 2.1416 2.2046 2.8372 1.6564 1.5278 2.5770 7.0276 2.9581 2.9005 3.8213 3.4512 5.4720 5.6542 3.6613 5.1500 5.7250 5.8855 2.5616 4.8311 5.2311 5.7314 4.7806 2.0074 1.1897 1.1451 1.5025 1.7303 1.6692 5.0370 1.6356 5.0484 3.6812 2.7656 2.2319 2.0880 2.0912 1.3476 1.3771 2.1464 2.8926 1.9483 1.5112 2.3372 2.9736 1.9239 2.1966 1.9155 2.0642 2.4437 2.0986 1.9062 1.7176 1.9918 1.4494 1.8674 1.4602 2.0182 1.7204 1.9056 1.6968 1.4482 2.0849 2.9055 1.1608 1.3236 1.2475 2.1984 1.7259 3.9521 1.7331 1.7774 1.4629 1.3536 1.3478 1.4143 2.8538 1.2300 1.2286 1.2857 4.9566 2.3970 3.2832 3.5793 1.1488 1.0641 1.0537 1.0477 1.1153 3.0147 2.5537 1.0807 1.0685 2.0295 1.1970 1.3673 1.0803 1.1240 3.5267 6.1196 6.6178 6.7819 7.1355 7.6126 1.0723 1.0717 1.0712 1.0678 1.0703 1.0375 1.0358 1.0363 1.0869 1.0906 1.0868 1.0902 1.0978 1.0987 1.0973 1.0980 1.0907 1.1003 1.1000 1.0916 1.0903 1.0888 1.0897 1.0948 1.0954 1.0757 1.0660 1.0797
irintensity: 0.1022 0.0170 0.4204 0.9473 0.3191 0.0146 0.0206 0.0800 0.8361 0.2058 3.7582 1.2548 0.6547 1.4114 0.1696 2.1279 1.4975 1.3551 3.6826 4.6261 1.9412 2.2490 3.2726 7.4192 1.4196 126.3492 0.4210 6.4550 6.0854 20.4147 0.7794 39.7888 0.1021 16.0824 33.8299 160.1206 3.2356 5.4091 10.3633 4.2724 6.5755 3.1439 2.9539 3.4127 9.5982 2.4169 10.9904 6.0284 10.5053 0.3252 6.3601 27.9901 10.0697 0.3065 5.2981 4.7419 38.0331 44.8253 14.7115 2.7291 47.6811 3.0075 7.2163 2.4959 9.0352 1.8630 0.4318 0.0862 0.3273 10.2889 3.6230 12.3681 2.4513 11.7185 6.8838 3.5884 23.8262 10.4449 1.7299 28.4111 34.9022 1.7255 125.6141 104.9603 104.7654 22.4968 38.9990 46.4830 11.5723 46.3739 1.9346 59.1878 19.3016 68.0923 0.8719 14.0682 14.4195 26.5718 1.9422 30.1184 56.6287 19.0139 30.9237 8.3643 8.9666 7.3353 65.0466 23.1588 12.5295 5.1155 30.2728 36.7934 5.5289 50.2646 31.7916 3.7723 6.2916 12.4164 1.6297 115.6991 115.2625 18.3710 13.0807 11.1615 59.7725 56.3168 25.8958 26.3808 465.2448 44.7659 83.4397 13.4327 9.6991 90.7413 33.6136 103.9522 205.9066 44.6829 101.0853 44.1764 39.1037 22.7081 17.2589 17.9082 16.6874 72.9892 16.4160 56.6106 24.6688 77.4544 2.5232 43.6668 24.0820 10.3521 15.3613 25.1772 10.9423 31.1641 8.3086 17.9902 37.1953 47.5052
temp: 298.150 k
press: 1.00000 atm
elementType: 8 7 7 7 7 6 6 6 6 6 6 6 6 6 6 6 6 6 6 6 6 6 6 6 6 6 6 6 1 1 1 1 1 1 1 1 1 1 1 1 1 1 1 1 1 1 1 1 1 1 1 1 1 1 1 1
symmnumber: 1
zpe: 1222652.7 jmol-1
zpe.correction: 0.465684 hartree
zpe.thermalcorrener: 0.492996 hartree
zpe.thermalcorrenthalpy: 0.493940 hartree
zpe.thermalcorrgfe: 0.405507 hartree
zpe.sumelectzpe: -1185.453786 hartree
zpe.sumelectthermal: -1185.426473 hartree
zpe.sumelectthermalent: -1185.425529 hartree
zpe.sumelectthermalfe: -1185.513962 hartree
dipole: -0.9107 -0.9105 0.5773
dipole: 1.4113
quadrupole: -161.2647 -152.8687 -169.9965
quadrupole: -25.2105 -3.3969 10.7889
quadrupole: 0.1119 8.5080 -8.6199 -25.2105 -3.3969 10.7889
hfenergy: -1185.9194696 hartree
pointgroup: C01[X(C23H28N4O1)]
dipole: -0.3829175 -0.3995063 0.0454289 debye
polarizability: 451.2685665|48.0081972|302.0999441|0.4508071|76.0935887|208.300844 unknown
InChI: InChI=1S/C23H28N4O/c1-4-27(5-2)12-6-10-24-23-20-14-19-18-13-16(28)7-8-21(18)26-22(19)15(3)17(20)9-11-25-23/h7-9,11,13-14,24,26,28H,4-6,10,12H2,1-3H3
charge 0 multiplicity 1
56 atoms
O  -5.051051 -3.776536 -2.18112
N  -4.240482 1.057085 0.532909
N  4.894706 -1.682502 0.586836
N  1.927218 0.103956 -1.178149
N  2.186577 2.070016 0.05827
C  -2.321786 0.126985 -0.348081
C  -2.852987 1.245326 0.406675
C  -2.047671 2.283144 0.897672
C  -0.0901 1.102628 -0.156336
C  -0.638768 2.208791 0.616736
C  -3.446158 -0.746606 -0.668943
C  -0.949552 0.065394 -0.61811
C  -4.618919 -0.139347 -0.108568
C  3.827552 -1.418273 -1.678497
C  3.85672 -2.197513 -0.341659
C  3.362471 0.041816 -1.5050
C  1.353959 1.111777 -0.419118
C  -2.624478 3.435486 1.698476
C  0.27927 3.208083 1.096508
C  -3.557102 -1.969211 -1.372149
C  6.245978 -2.226367 0.287188
C  4.523066 -1.814366 2.021914
C  -5.892021 -0.73098 -0.238865
C  1.636916 3.083754 0.811601
C  -4.834626 -2.558169 -1.499737
C  -5.990889 -1.949309 -0.941029
C  7.387798 -1.304495 0.758214
C  3.428729 -0.820751 2.457092
H  -0.557754 -0.795545 -1.171965
H  4.838735 -1.408468 -2.129097
H  3.171421 -1.952293 -2.400462
H  3.994336 -3.288767 -0.54853
H  2.869514 -2.087818 0.142353
H  -4.876982 1.683348 1.018001
H  3.916651 0.515381 -0.679221
H  3.574871 0.62712 -2.424765
H  1.312055 -0.528003 -1.689007
H  -2.192551 3.476631 2.716359
H  -2.412215 4.408187 1.216251
H  -3.719872 3.361939 1.812555
H  6.37947 -3.249338 0.725722
H  6.325536 -2.348057 -0.809477
H  4.206046 -2.861627 2.266301
H  5.431497 -1.617217 2.620161
H  -0.074154 4.057553 1.685729
H  -2.6718 -2.450086 -1.80791
H  -6.7881 -0.268587 0.188147
H  2.356207 3.824752 1.179426
H  -6.954323 -2.450635 -1.07087
H  7.289534 -0.310145 0.288886
H  7.379367 -1.163274 1.85408
H  8.370041 -1.733448 0.48401
H  3.742766 0.214141 2.23724
H  2.472404 -0.99413 1.931357
H  3.235372 -0.915083 3.542241
H  -4.199942 -4.132747 -2.536939
