program: Gaussian 09
title: 000149451
version: EM64L-G09RevD.01
frameworkgroup: C1[X(C21H18O3)]
method: RPBEPBE
basis: SDD
operation: Freq
keyword: #pfreq=noraman
keyword: PBEPBE/SDD
title: #p freq=noraman PBEPBE/SDD
converged: YES YES NO NO
title: Mulliken charges:
elementType: O O O C C C C C C C C C C C C C C C C C C C C C H H H H H H H H H H H H H H H H H H
charge: -0.444291 -0.426212 -0.417476 0.119272 -0.262336 -0.260325 -0.564573 0.128558 0.336251 0.286402 0.651271 0.080731 -0.753973 0.447022 0.285736 -0.358585 -0.461377 -0.501637 -0.428302 -0.215180 -0.353245 -0.279200 -0.202728 -0.826909 0.222360 0.244140 0.224330 0.233698 0.204694 0.271625 0.241517 0.233507 0.187332 0.222331 0.211471 0.224689 0.338961 0.235222 0.232927 0.232061 0.330321 0.329920
chargesum: 0.00000
title: Mulliken charges with hydrogens summed into heavy atoms:
elementType: O O O C C C C C C C C C C C C C C C C C C C C C
charge: -0.105329 -0.095891 -0.087555 0.119272 -0.262336 -0.037965 -0.096103 0.128558 0.336251 0.286402 0.651271 0.080731 -0.520275 0.447022 0.285736 -0.153890 -0.189752 -0.260121 -0.194795 -0.027849 -0.130914 -0.067729 0.021961 -0.126698
polarizability: 4.36735172e+02 -1.58375060e+01 2.59323246e+02 -1.12907173e+00 -5.06717898e-02 1.21937889e+02
1716.lowfreq: -1.8407 -0.0007 -0.0006 0.0005 4.0768 8.5543 37.6600 41.9005 50.1322
frequency: 37.6503 41.8857 50.1274 56.9398 68.2320 91.1029 123.8840 152.2703 159.0860 198.8978 212.3528 231.0780 235.0756 243.4759 257.5397 274.3646 279.2420 291.8605 321.4865 350.9352 368.3988 376.8984 397.1211 438.7426 459.6106 464.8696 498.1734 507.6411 515.2043 520.9242 547.8390 568.2313 581.0420 591.1195 613.2413 632.9813 661.0861 685.7922 733.2211 753.1759 762.9961 788.1922 797.1905 805.5232 822.9979 834.1504 855.2945 859.1757 886.8962 913.4283 920.2004 943.0802 952.8520 966.2541 968.8756 972.6530 978.3912 981.2629 991.2932 1008.6792 1020.1079 1041.1134 1062.6967 1092.3818 1120.2198 1164.1898 1165.8679 1170.0554 1173.2885 1177.0195 1187.6548 1195.4180 1221.9149 1227.0748 1231.8002 1238.2186 1260.8938 1272.4298 1281.9581 1302.3974 1332.4050 1338.9663 1351.1133 1360.9554 1376.9875 1391.7226 1398.1494 1398.8002 1423.6560 1430.9672 1442.4010 1464.6822 1469.9617 1470.9909 1472.4530 1499.5186 1545.5447 1580.3501 1603.4597 1624.7647 1640.4836 1652.4922 2914.2263 2920.6453 2937.7931 2971.9444 2988.4605 3043.8279 3045.6599 3085.4109 3110.7246 3128.7223 3134.2101 3138.7309 3149.7687 3165.0231 3165.3548 3514.4272 3517.0111 3542.6994
redmass: 4.6999 5.3928 2.9921 1.2025 3.9201 3.9156 5.2008 4.0801 4.4983 3.9205 4.2552 3.0504 1.2720 2.8217 4.4338 1.9395 1.7043 1.2042 3.7364 4.7149 4.5123 4.3423 3.6957 5.0150 3.8139 5.2297 3.7309 6.4051 4.0370 3.5640 3.9309 4.3014 4.3634 4.4204 5.2166 5.2716 4.2225 3.4206 4.1266 1.9825 4.9089 4.0234 2.5917 1.7663 2.3732 3.1838 2.8831 2.6103 3.8298 2.9800 2.4016 6.2610 2.3428 2.2567 1.5749 1.4568 1.8028 2.2283 3.9047 2.7401 4.2522 1.5821 2.1941 2.0074 2.1375 1.2436 1.2185 1.1235 1.1846 1.2679 1.3239 1.4466 1.6029 1.9758 1.7405 1.4840 2.3308 1.3677 1.1666 1.6270 2.0136 2.7699 1.7001 2.0450 2.6595 2.5038 1.3391 2.2203 3.0922 2.1306 1.2888 2.6707 3.6210 1.4488 1.0677 3.9594 5.9997 8.3250 7.3024 7.8406 7.6822 7.1739 1.0821 1.0843 1.0840 1.0378 1.0602 1.1023 1.0973 1.0977 1.0864 1.0886 1.0863 1.0965 1.0894 1.0965 1.0967 1.0659 1.0658 1.0662
irintensity: 2.4817 0.4149 0.6914 0.2236 0.2886 0.0723 2.4364 0.4660 1.8589 7.1454 9.9461 5.7175 83.1957 19.3805 2.7637 88.7853 137.7280 108.4102 11.5192 4.4865 3.5709 2.2363 2.7931 0.7704 10.4439 0.5046 1.4159 4.4782 3.0227 10.6676 2.5429 4.5064 0.3802 6.5826 10.8390 6.5515 8.9178 10.0597 12.7458 41.9435 9.6276 9.4090 1.6821 19.9192 18.0595 5.1843 17.0525 36.2805 2.2222 13.9999 21.7029 86.5392 30.7138 27.0271 25.5066 7.6254 16.0528 10.3702 10.3526 21.4474 42.7606 3.2501 5.0057 19.1861 25.8416 14.4174 50.6271 23.3305 22.1534 28.5155 6.1800 2.3562 11.3002 10.5657 13.7730 1.6161 0.3658 3.9375 0.9942 1.3979 11.7673 3.2422 11.2495 5.2420 5.8615 12.0000 5.6146 4.1536 14.3354 4.8784 2.1554 3.8461 13.8874 4.9355 10.5534 5.8038 7.4197 5.2854 6.1663 0.0685 6.7220 7.1559 80.2050 84.4742 42.2561 53.2374 37.6458 19.1790 19.9646 17.7910 9.4376 12.2662 2.1241 33.3763 2.7126 24.9241 18.2860 6.7572 10.0624 2.9263
temp: 298.150 k
press: 1.00000 atm
elementType: 8 8 8 6 6 6 6 6 6 6 6 6 6 6 6 6 6 6 6 6 6 6 6 6 1 1 1 1 1 1 1 1 1 1 1 1 1 1 1 1 1 1
symmnumber: 1
zpe: 867019.6 jmol-1
zpe.correction: 0.330230 hartree
zpe.thermalcorrener: 0.350829 hartree
zpe.thermalcorrenthalpy: 0.351773 hartree
zpe.thermalcorrgfe: 0.281125 hartree
zpe.sumelectzpe: -1035.015606 hartree
zpe.sumelectthermal: -1034.995007 hartree
zpe.sumelectthermalent: -1034.994063 hartree
zpe.sumelectthermalfe: -1035.064710 hartree
dipole: 0.5213 1.7009 -1.1564
dipole: 2.1218
quadrupole: -92.9129 -120.7569 -152.4076
quadrupole: -0.9603 -0.7490 1.3140
quadrupole: 29.1129 1.2689 -30.3818 -0.9603 -0.7490 1.3140
hfenergy: -1035.3458358 hartree
pointgroup: C01 [X(C21H18O3)]
dipole: 0.1948234 0.6609824 -0.4711807 debye
polarizability: 437.0287217|-13.9801576|258.9335958|-2.9056441|-3.0358565|122.0339901 unknown
InChI: InChI=1S/C21H18O3/c1-10-2-3-11-8-16-12-6-7-17(22)21(24)14(12)5-4-13(16)20-18(23)9-15(10)19(11)20/h2-8,17-18,21-24H,9H2,1H3
charge 0 multiplicity 1
42 atoms
O  2.011104 3.235753 0.877776
O  -4.656115 0.752425 -1.661415
O  -5.184432 -0.622961 1.810893
C  1.424365 1.059047 -0.09733
C  2.21129 -0.103891 -0.057226
C  2.335787 2.274878 -0.20078
C  3.797936 1.687999 -0.091694
C  3.617316 0.17098 -0.063171
C  0.010033 0.961548 -0.094279
C  -0.593743 -0.379677 -0.06708
C  1.656306 -1.425575 -0.019493
C  -2.048776 -0.481035 -0.085781
C  0.244243 -1.532875 -0.026324
C  -2.831261 0.68858 -0.119157
C  4.526479 -0.883676 -0.031667
C  -4.34106 0.602477 -0.216212
C  -0.837635 2.120966 -0.112497
C  2.611849 -2.505687 0.010373
C  -2.220035 1.980966 -0.125859
C  -4.956842 -0.707553 0.345552
C  3.979585 -2.230202 0.001621
C  -2.734939 -1.78419 -0.061779
C  -4.078536 -1.910786 0.126778
C  6.030882 -0.687142 -0.021257
H  2.196993 2.78234 -1.180968
H  4.253942 2.050399 0.85028
H  4.439991 2.022226 -0.927975
H  -0.198392 -2.533116 0.004675
H  -4.791249 1.453854 0.345433
H  -0.36756 3.107917 -0.083667
H  2.259467 -3.543539 0.036407
H  -2.865272 2.866815 -0.150028
H  -5.934806 -0.861443 -0.168453
H  4.691448 -3.065762 0.02353
H  -2.141544 -2.695197 -0.18467
H  -4.551462 -2.89692 0.177425
H  2.548658 4.057603 0.739072
H  6.480616 -1.091145 0.906211
H  6.305652 0.37902 -0.08931
H  6.511004 -1.215189 -0.867254
H  -5.64313 0.800256 -1.767276
H  -5.866357 0.078112 1.986579
