program: Gaussian 09
title: 000149409
version: EM64L-G09RevD.01
frameworkgroup: C1[X(C13H10N2)]
method: RPBEPBE
basis: SDD
operation: Freq
keyword: #pfreq=noraman
keyword: PBEPBE/SDD
title: #p freq=noraman PBEPBE/SDD
converged: NO NO NO YES
title: Mulliken charges:
elementType: N N C C C C C C C C C C C C C H H H H H H H H H H
charge: -0.037590 -0.699938 0.303619 0.287811 0.339525 0.002829 -0.365112 -0.374909 -0.554956 -0.564227 -0.396767 0.547829 -0.465395 -0.239612 -0.251499 0.217503 0.223781 0.253570 0.247827 0.233240 0.217453 0.226063 0.229585 0.312021 0.307348
chargesum: 0.00000
title: Mulliken charges with hydrogens summed into heavy atoms:
elementType: N N C C C C C C C C C C C C C
charge: -0.037590 -0.080568 0.303619 0.287811 0.339525 0.002829 -0.147609 -0.151128 -0.301386 -0.316399 -0.163528 0.547829 -0.247941 -0.013549 -0.021914
polarizability: 2.87786035e+02 1.62082947e+00 1.58836674e+02 -6.43097705e-03 -3.92699774e-03 5.96892888e+01
1716.lowfreq: -6.0954 -5.5428 -0.0007 -0.0005 0.0003 10.2757 71.7510 106.3990 184.9553
frequency: 71.7470 106.3987 184.9550 198.8169 224.7166 323.0292 325.2313 361.6684 389.2889 396.8879 407.7862 439.5786 463.8436 493.0671 531.1893 541.0949 554.4147 571.9996 656.9945 680.3837 718.2149 726.9495 761.8718 762.1298 788.2115 824.8191 867.4870 867.8034 886.6684 931.0200 939.2573 945.5483 966.2976 988.6718 990.5168 1032.6911 1042.0342 1106.8394 1139.2828 1164.4353 1175.6064 1231.8993 1243.2928 1271.7358 1317.4009 1330.3598 1360.3579 1389.9675 1407.0820 1420.3109 1448.1096 1471.6988 1481.7718 1538.4854 1560.0455 1576.7492 1619.2983 1636.8802 1647.8865 3089.7599 3117.7472 3118.6525 3129.0798 3142.9708 3147.8305 3150.4283 3163.2376 3565.9508 3706.2765
redmass: 4.7539 3.7040 4.5166 4.4910 4.4527 3.8887 4.1568 1.1553 4.8775 1.2286 2.8075 2.9861 4.6254 6.5934 2.8080 3.2694 6.7250 6.8253 3.7025 5.7891 6.1813 3.4176 6.6874 1.2972 1.9002 1.9589 1.4406 4.9983 1.9520 1.4583 2.8258 1.3775 1.4458 7.2429 1.3437 2.0822 1.4958 2.3606 1.7329 1.4754 1.0953 1.4980 1.9065 1.6481 2.4562 2.8149 2.3797 2.1394 4.9987 3.5796 4.0520 4.3520 3.0498 4.1152 7.3138 7.1495 6.1980 1.8202 2.1824 1.0908 1.0865 1.0871 1.0879 1.0955 1.0923 1.0937 1.0999 1.0450 1.1040
irintensity: 3.7625 0.8179 2.3676 3.3204 1.4416 6.1561 1.6756 169.2494 0.1564 134.3538 12.9026 1.8706 1.2341 1.0187 2.7195 0.3525 0.4416 7.2142 12.2302 1.3593 0.5913 5.5552 3.8145 78.2932 20.3562 26.8371 1.0785 8.0873 27.0108 16.5628 6.0336 0.3407 10.0526 0.3292 0.1678 9.8952 3.9633 11.9332 2.0477 4.9918 0.0656 49.9015 11.0396 5.0845 1.8915 76.8245 5.3246 4.7837 0.1309 9.7952 16.0061 18.5529 105.1046 14.0073 34.8948 19.5543 92.6698 7.4910 480.6674 24.3708 18.9385 2.0232 9.0791 3.7332 12.8298 45.9100 35.5396 117.6707 22.3641
temp: 298.150 k
press: 1.00000 atm
elementType: 7 7 6 6 6 6 6 6 6 6 6 6 6 6 6 1 1 1 1 1 1 1 1 1 1
symmnumber: 1
zpe: 513405.6 jmol-1
zpe.correction: 0.195546 hartree
zpe.thermalcorrener: 0.206648 hartree
zpe.thermalcorrenthalpy: 0.207592 hartree
zpe.thermalcorrgfe: 0.159014 hartree
zpe.sumelectzpe: -609.898995 hartree
zpe.sumelectthermal: -609.887893 hartree
zpe.sumelectthermalent: -609.886949 hartree
zpe.sumelectthermalfe: -609.935526 hartree
dipole: -1.7134 -2.3906 0.0019
dipole: 2.9411
quadrupole: -55.0304 -81.1689 -94.1712
quadrupole: 3.6319 -0.0114 -0.0011
quadrupole: 21.7598 -4.3788 -17.3810 3.6319 -0.0114 -0.0011
hfenergy: -610.0945407 hartree
pointgroup: C01 [X(C13H10N2)]
dipole: 0.6718494 -0.9421168 -0.0007466 debye
dipolederiv: -0.5678099 -0.138997 0.000005 -0.0526902 -0.2270556 0.0000043 -0.0000012 0.000005 -0.2609981 -1.9721017 0.0376698 -0.0002655 -0.0954915 -0.0756929 0.0000971 -0.0011514 0.000135 -0.7438063 -0.5680873 0.0736756 -0.0000059 -0.1453186 -0.2411519 0.0000047 -0.0000095 -0.0000171 0.0000855 0.7173068 -0.0640396 -0.0000126 0.125941 0.0006796 -0.0000072 -0.0000159 0.0000001 0.0250071 -0.2700607 -0.078456 0.0000048 0.1342494 -0.3711477 -0.0000135 0.0000171 -0.0000109 0.0718311 0.808554 -0.0268631 0.0000028 0.081789 0.0175198 -0.000003 -0.0000002 0.0000111 0.0651657 0.2921719 -0.1393231 -0.0000002 -0.0845284 0.159377 0.0000156 -0.0000161 0.0000059 -0.1241147 -0.3405494 -0.0167611 0.0000059 -0.2022356 0.085383 0.0000062 0.0000024 -0.0000082 -0.1664498 -0.7005243 -0.023831 -0.000016 0.5668423 0.0601458 0.0000028 0.0001212 0.000028 -0.2376095 0.3443592 0.1710425 -0.0000013 0.1140375 0.5009636 0.0000056 -0.0000119 0.0000107 -0.0719383 0.1630313 0.0766543 -0.0000085 -0.1317064 0.1667499 0.0000184 -0.0000197 0.0000231 -0.1496632 2.0765507 -0.0266766 0.0001373 0.0476647 -0.0456058 -0.000032 0.0002039 -0.0000574 0.1475964 -0.5014207 0.0690876 0.0000102 -0.4372324 0.1036849 0.0000224 -0.0000004 0.0000147 -0.2181286 0.0910071 -0.0127174 -0.0000098 0.0149738 0.1823371 0.0000045 -0.0000155 0.0000061 -0.1428616 -0.0210967 -0.0457239 -0.0000143 -0.0411634 -0.2153837 0.0000007 -0.0000059 0.0000019 -0.1823016 0.0648636 -0.1034965 -0.0000032 -0.0459463 -0.0746715 -0.0000102 0.0000101 -0.0000087 0.1395038 0.0547725 0.110329 0.0000038 0.0469902 -0.0596673 -0.0000041 0.0000039 0.0000014 0.1459427 0.0168638 -0.0589479 0.0000026 -0.1026235 -0.0225651 0.0000055 -0.0000035 -0.0000068 0.1718511 -0.0167035 0.1293722 0.0000074 0.0741428 -0.06927 -0.0000059 0.000006 -0.0000104 0.115081 0.0437865 0.0427452 0.0000063 0.1260296 -0.0755554 -0.0000141 0.0000131 -0.0000173 0.1539618 -0.042567 0.1128085 0.0000112 0.1102319 -0.0536444 -0.0000193 0.0000044 -0.0000138 0.165154 0.0075599 -0.0952888 0.0000051 -0.1242417 -0.0690219 0.0000002 0.0000043 0.0000002 0.1563935 -0.1548698 0.0040454 0.0000135 0.0002281 0.090534 -0.0000014 0.0000135 -0.0000025 0.1647541 0.2321228 0.0181498 0.0000601 0.0746598 0.1140602 0.0000293 0.0003844 0.0000886 0.3874186 0.2428408 -0.0144578 0.0000609 -0.0546025 0.1189983 -0.0001065 0.0004669 -0.0001787 0.3881254 unknown
polarizability: 287.7775938|-1.927552|158.8451147|-0.0064216|0.0039423|59.6892888 unknown
InChI: InChI=1S/C13H10N2/c14-10-5-6-12-11-4-2-1-3-9(11)8-15-13(12)7-10/h1-8H,14H2
charge 0 multiplicity 1
25 atoms
N  0.360424 2.106981 0.000068
N  4.658935 -0.149765 0.000002
C  0.389943 -0.398081 -0.000034
C  -1.067227 -0.42187 0.000018
C  -1.757896 0.844114 0.000079
C  1.059443 0.883877 0.000023
C  1.209465 -1.5659 -0.000131
C  -1.853747 -1.615416 -0.000003
C  2.476134 0.959475 -0.000043
C  -0.969539 2.060016 0.000092
C  -3.18397 0.886453 0.000125
C  3.266726 -0.210827 -0.000121
C  2.603728 -1.485624 -0.000145
C  -3.254197 -1.553782 0.000069
C  -3.930977 -0.297776 0.000128
H  0.744918 -2.557923 -0.000175
H  -1.363393 -2.594416 -0.000025
H  2.926494 1.957776 -0.000014
H  -1.495163 3.025698 0.00013
H  -3.684054 1.863136 0.000191
H  3.204919 -2.403427 -0.000185
H  -3.837792 -2.481579 0.000081
H  -5.025772 -0.266319 0.000178
H  5.139278 0.745279 -0.000361
H  5.219419 -0.996602 -0.000647
