program: Gaussian 09
title: 000149408
version: EM64L-G09RevD.01
frameworkgroup: C1[X(C18H14)]
method: RPBEPBE
basis: SDD
operation: Freq
keyword: #p
keyword: freq=noraman
keyword: PBEPBE/SDD
title: #p freq=noraman PBEPBE/SDD
converged: NO YES NO NO
title: Mulliken charges:
elementType: C C C C C C C C C C C C C C C C C C H H H H H H H H H H H H H H
charge: 0.257416 0.257419 0.221199 0.221196 -0.544210 -0.544211 -0.529264 -0.529264 0.194579 0.194579 0.455593 0.455592 -0.567647 -0.567645 -0.650567 -0.650568 -0.501677 -0.501679 0.236334 0.236334 0.236336 0.236333 0.235197 0.235202 0.235196 0.235203 0.234575 0.234576 0.250404 0.250405 0.236531 0.236532
chargesum: 0.00000
title: Mulliken charges with hydrogens summed into heavy atoms:
elementType: C C C C C C C C C C C C C C C C C C
charge: 0.257416 0.257419 0.221199 0.221196 -0.071541 -0.071543 -0.058865 -0.058865 0.194579 0.194579 0.455593 0.455592 -0.333071 -0.333069 -0.400163 -0.400163 -0.265146 -0.265147
polarizability: 3.35459635e+02 -1.31320703e-05 2.02801939e+02 -2.01203645e-03 -1.80214076e-03 8.88415415e+01
1716.lowfreq: -5.8404 -0.0008 -0.0006 -0.0004 2.2631 16.6633 68.3079 76.3548 143.4961
frequency: 68.2452 76.3544 143.4909 152.7114 159.0964 215.6768 220.7709 291.0922 292.1931 313.9777 318.4407 392.6338 406.0167 423.2691 451.0141 479.0518 561.2043 562.1553 562.3972 596.2105 621.6052 702.0335 727.4432 742.8302 748.2234 751.7076 769.8700 801.4560 814.0880 820.0187 823.1029 826.9519 884.8745 892.1168 896.0831 902.1211 910.7945 911.3790 933.2111 978.5687 1016.5137 1027.5097 1027.5831 1069.0046 1069.6094 1081.5279 1131.9225 1151.2342 1151.2479 1159.8114 1167.8607 1183.9739 1184.2085 1208.0066 1211.1847 1220.1745 1228.5695 1242.5256 1255.4121 1267.2369 1355.4857 1381.8475 1393.0119 1418.1302 1438.7852 1438.7994 1446.3213 1448.4178 1458.0762 1464.9674 1504.0918 1545.3537 1613.4486 1631.4397 1637.0519 1639.5369 3005.1516 3005.1976 3013.7972 3014.3006 3063.9715 3063.9767 3082.6278 3082.6810 3112.1633 3126.0070 3126.1567 3138.4101 3147.6442 3158.9190
redmass: 3.8890 3.3121 3.2667 2.6853 4.5208 2.2726 2.4833 3.2073 3.5179 4.4221 5.9913 3.1082 2.8617 4.6190 5.3291 4.3503 3.3731 3.3124 5.7289 6.8950 3.1061 6.0256 2.6380 5.5051 1.1584 1.1864 5.5176 4.2932 2.0849 3.6316 1.3915 4.9825 1.4908 1.3352 3.6549 2.0723 1.5841 3.7622 2.7594 1.4096 4.6186 2.1353 2.1249 1.1821 1.1830 3.5225 2.0996 1.1365 1.1364 1.8783 2.2634 1.3543 1.3102 1.8300 1.4340 1.6122 1.6890 3.0429 1.9944 1.7045 4.4656 3.7755 2.4971 7.9425 1.0886 1.0873 2.0715 1.2440 1.6050 2.4634 4.2751 7.3409 9.3149 7.4021 7.5742 7.9575 1.0567 1.0567 1.0617 1.0617 1.1064 1.1064 1.1053 1.1053 1.0859 1.0932 1.0926 1.0978 1.0922 1.0891
irintensity: 1.8013 0.0000 0.0000 3.9437 0.9403 0.0000 3.9198 0.0000 6.2153 2.0451 1.3148 0.0000 17.8691 1.1233 0.9616 0.3883 2.4733 0.0000 0.4841 3.9090 0.0000 0.0492 7.4249 0.5316 3.8991 0.0000 0.0718 0.5817 0.0000 0.0186 2.0500 4.3252 0.0000 51.0774 2.5240 0.0000 59.6131 1.5199 1.8475 0.0000 1.1182 0.0000 0.0478 0.0000 5.9624 0.0030 1.6000 0.0000 0.0015 0.6305 0.4610 0.4115 0.8080 25.6992 1.9659 3.7200 9.7395 0.2701 2.6781 2.1347 0.4174 3.0433 13.5192 0.4880 8.0050 2.4321 50.2126 9.0492 18.3281 8.6107 7.1022 0.9675 0.0002 0.1710 0.7074 0.0002 6.4485 56.1341 181.3031 26.0070 0.0003 0.2057 0.0045 82.9463 0.7372 12.5731 13.6355 42.5046 0.7941 15.5365
temp: 298.150 k
press: 1.00000 atm
elementType: 6 6 6 6 6 6 6 6 6 6 6 6 6 6 6 6 6 6 1 1 1 1 1 1 1 1 1 1 1 1 1 1
symmnumber: 1
zpe: 676819.4 jmol-1
zpe.correction: 0.257787 hartree
zpe.thermalcorrener: 0.270993 hartree
zpe.thermalcorrenthalpy: 0.271937 hartree
zpe.thermalcorrgfe: 0.218436 hartree
zpe.sumelectzpe: -693.060803 hartree
zpe.sumelectthermal: -693.047597 hartree
zpe.sumelectthermalent: -693.046653 hartree
zpe.sumelectthermalfe: -693.100153 hartree
dipole: 0.0000 -0.7495 -0.0001
dipole: 0.7495
quadrupole: -85.8575 -93.5745 -109.0373
quadrupole: 0.0000 0.0003 -0.0002
quadrupole: 10.2989 2.5820 -12.8809 0.0000 0.0003 -0.0002
hfenergy: -693.3185895 hartree
pointgroup: C01 [X(C18H14)]
dipole: -0.0000039 -0.2948587 0.0000261 debye
polarizability: 335.4596347|-0.0002336|202.8019392|-0.002012|0.0018021|88.8415415 unknown
InChI: InChI=1S/C18H14/c1-3-13-9-17-15(7-11(1)13)5-6-16-8-12-2-4-14(12)10-18(16)17/h5-10H,1-4H2
charge 0 multiplicity 1
32 atoms
C  -2.875182 -1.16467 0.000022
C  2.875186 -1.164679 -0.000027
C  -3.564821 0.084516 0.000062
C  3.564829 0.084503 -0.000038
C  -4.177785 -1.982108 -0.000047
C  4.177782 -1.982124 0.000041
C  -4.950909 -0.580611 0.000075
C  4.950915 -0.580632 0.0000
C  -0.7346 -0.031913 0.000037
C  0.734608 -0.031916 0.000021
C  -1.44506 1.237137 0.000064
C  1.445072 1.237134 0.000019
C  -1.489501 -1.258969 0.000008
C  1.489506 -1.258974 0.00001
C  -2.884324 1.293259 0.000064
C  2.884338 1.293251 0.000004
C  -0.690467 2.467988 0.000082
C  0.690483 2.467988 0.000052
H  -4.354186 -2.600509 -0.897862
H  -4.354201 -2.600682 0.897638
H  4.354149 -2.600553 0.897841
H  4.354224 -2.600674 -0.897659
H  -5.567795 -0.399281 0.897801
H  -5.567895 -0.39916 -0.897551
H  5.567839 -0.399287 -0.897693
H  5.56786 -0.399206 0.897662
H  -0.98522 -2.229512 -0.000042
H  0.985222 -2.229515 0.000044
H  -3.384044 2.269089 0.000085
H  3.384061 2.269079 0.00002
H  -1.244679 3.414367 0.000109
H  1.244698 3.414365 0.000057
