program: Gaussian 09
title: 000149416
version: EM64L-G09RevD.01
frameworkgroup: C1[X(C10H12ClN3O2)]
method: RPBEPBE
basis: SDD
operation: Freq
keyword: #p
keyword: freq=noraman
keyword: PBEPBE/SDD
title: #p freq=noraman PBEPBE/SDD
converged: YES YES NO NO
title: Mulliken charges:
elementType: Cl O O N N N C C C C C C C C C C H H H H H H H H H H H H
charge: -0.050764 -0.257278 -0.227879 -0.213867 -0.208084 0.077131 0.405600 0.286897 -0.332893 -0.660879 -0.315685 -0.351372 -0.574374 -0.223441 -0.229352 -0.243317 0.260711 0.267982 0.246818 0.248734 0.261906 0.296992 0.248036 0.282294 0.311598 0.230955 0.229988 0.233543
chargesum: 0.00000
title: Mulliken charges with hydrogens summed into heavy atoms:
elementType: Cl O O N N N C C C C C C C C C C
charge: -0.050764 -0.257278 -0.227879 -0.213867 -0.208084 0.077131 0.405600 0.286897 0.195801 0.096579 -0.018692 -0.103336 0.019517 0.007514 0.000636 -0.009775
polarizability: 2.24674547e+02 -7.95793393e+00 1.52671088e+02 -1.02685561e+01 -8.18598051e+00 7.95082234e+01
1716.lowfreq: -4.5881 -0.0010 -0.0007 0.0006 5.3913 7.1444 22.8871 37.8083 44.7044
frequency: 22.8199 37.7336 44.6757 64.6915 101.1794 110.9091 143.3581 181.7941 198.3764 215.1780 232.5668 275.5398 304.9264 327.3392 354.1433 376.1464 387.5943 407.5163 451.7020 481.5894 523.7241 593.0271 614.3903 654.4296 687.9622 695.1823 706.4905 738.1963 767.3693 790.8514 821.6256 838.2532 894.5563 916.2897 973.1587 986.3932 995.5729 1021.3257 1031.7433 1042.2353 1053.3102 1090.6441 1100.9342 1120.3938 1163.0347 1176.6961 1200.2988 1213.7392 1245.1452 1264.2785 1315.0843 1326.2126 1335.3259 1353.1170 1367.1036 1382.0082 1435.9703 1443.2599 1447.6178 1457.7402 1481.2158 1484.0660 1489.8647 1587.0807 1600.8614 1614.5264 3011.3834 3043.1150 3080.0914 3104.6360 3119.9448 3131.4246 3132.4997 3142.6193 3159.7884 3171.7745 3174.0420 3209.0919
redmass: 4.5565 9.7722 8.8001 5.3976 2.5087 7.0743 5.1067 4.4661 10.6745 5.2312 5.7431 1.2178 3.8246 3.1484 5.1300 4.3018 4.6854 2.8933 6.5424 8.2011 3.3235 6.4899 6.3089 5.5673 7.1648 2.0899 6.7364 2.1481 1.7600 2.0243 5.2527 1.2522 2.7667 1.4214 1.3662 5.7742 1.3240 4.1430 2.0194 1.5927 3.9451 1.7232 1.7345 1.4615 2.5341 1.0657 1.1381 1.9991 3.3259 1.1704 1.4188 1.5076 2.0560 1.7574 3.4011 8.7537 1.1838 1.9924 1.2084 1.0895 1.0858 2.0444 1.0876 6.2697 7.8483 6.8914 1.0342 1.0595 1.0562 1.1036 1.1042 1.0961 1.0893 1.0902 1.0944 1.0992 1.1128 1.0942
irintensity: 0.4547 1.0329 0.7780 1.3690 2.8014 4.2361 6.3967 1.1681 1.6802 8.1452 4.8529 0.2442 0.3087 3.4591 3.0727 7.5811 12.9701 0.1697 4.2938 7.2171 13.5450 25.7372 0.7517 16.3119 38.4941 57.9332 41.0731 1.0039 92.8047 65.9728 55.9991 1.5538 135.9247 3.9528 0.4040 1.3938 0.8368 102.0358 66.4481 16.9540 46.7347 16.4611 19.3808 9.8952 25.2319 1.6639 0.0860 10.6229 16.6718 5.8594 40.5497 129.6288 181.3732 82.2831 61.4412 1.6283 26.9240 4.9071 20.8013 14.7242 16.9238 111.2194 23.4159 51.9069 231.5843 72.0456 26.6826 4.6735 8.2541 14.3311 0.8536 15.6023 2.4578 12.5038 29.3598 13.8425 1.0651 4.7981
temp: 298.150 k
press: 1.00000 atm
elementType: 17 8 8 7 7 7 6 6 6 6 6 6 6 6 6 6 1 1 1 1 1 1 1 1 1 1 1 1
symmnumber: 1
zpe: 557714.0 jmol-1
zpe.correction: 0.212422 hartree
zpe.thermalcorrener: 0.228063 hartree
zpe.thermalcorrenthalpy: 0.229007 hartree
zpe.thermalcorrgfe: 0.167276 hartree
zpe.sumelectzpe: -1161.774558 hartree
zpe.sumelectthermal: -1161.758918 hartree
zpe.sumelectthermalent: -1161.757973 hartree
zpe.sumelectthermalfe: -1161.819704 hartree
dipole: 4.2052 1.3489 1.6008
dipole: 4.6974
quadrupole: -103.7035 -102.8311 -100.6311
quadrupole: 1.2283 -2.9691 4.3878
quadrupole: -1.3149 -0.4425 1.7574 1.2283 -2.9691 4.3878
hfenergy: -1161.9869804 hartree
pointgroup: C01 [X(C10H12Cl1N3O2)]
dipole: 1.6114823 0.547302 0.7204271 debye
polarizability: 225.5381941|-1.9300816|152.9926193|-9.001447|1.003673|78.323045 unknown
InChI: InChI=1S/C10H12ClN3O2/c1-13(9-5-3-2-4-6-9)10(15)14(12-16)8-7-11/h2-6H,7-8H2,1H3
charge 0 multiplicity 1
28 atoms
Cl -5.301596 -1.760389 -0.280957
O  -0.660329 -1.419809 -0.114263
O  -3.092613 2.309999 -0.464268
N  0.52296 0.544443 0.48171
N  -1.87978 0.53291 0.219499
N  -1.91412 1.841619 -0.329135
C  1.848594 0.057512 0.14402
C  -0.616412 -0.189992 0.180587
C  -3.131138 -0.217777 0.507063
C  0.454937 1.847648 1.199288
C  2.157808 -1.326427 0.048917
C  2.875522 1.014906 -0.079906
C  -3.711079 -0.867438 -0.760975
C  3.473398 -1.728975 -0.267358
C  4.185717 0.596619 -0.391365
C  4.495142 -0.77859 -0.486794
H  -2.894932 -0.992267 1.252604
H  -3.855588 0.501843 0.925542
H  1.309264 1.901168 1.893641
H  -0.474479 1.901469 1.783302
H  0.478001 2.70705 0.510163
H  1.377219 -2.069832 0.209199
H  2.65621 2.085568 -0.036695
H  -3.999797 -0.125744 -1.518411
H  -3.035735 -1.631786 -1.166234
H  3.696642 -2.799359 -0.335551
H  4.961078 1.35021 -0.567328
H  5.512805 -1.102476 -0.728797
