program: Gaussian 09
title: 000149407
version: EM64L-G09RevD.01
frameworkgroup: C1[X(C18H14)]
method: RPBEPBE
basis: SDD
operation: Freq
keyword: #p
keyword: freq=noraman
keyword: PBEPBE/SDD
title: #p freq=noraman PBEPBE/SDD
converged: NO YES NO YES
title: Mulliken charges:
elementType: C C C C C C C C C C C C C C C C C C H H H H H H H H H H H H H H
charge: 0.091244 0.088077 -0.550943 0.185830 -0.534154 0.245805 0.213490 0.229373 -0.543262 -0.531789 0.452933 -0.581787 0.471682 -0.665533 -0.450712 -0.462001 -0.513409 -0.498178 0.237759 0.237754 0.232078 0.232077 0.235914 0.235917 0.235141 0.235145 0.264325 0.251259 0.243481 0.238505 0.237739 0.236241
chargesum: 0.00000
title: Mulliken charges with hydrogens summed into heavy atoms:
elementType: C C C C C C C C C C C C C C C C C C
charge: 0.091244 0.088077 -0.075430 0.185830 -0.069999 0.245805 0.213490 0.229373 -0.071430 -0.061503 0.452933 -0.317462 0.471682 -0.414274 -0.207231 -0.223496 -0.275671 -0.261937
polarizability: 3.12069107e+02 -3.64038119e+00 2.15646428e+02 7.83756874e-04 -4.11645875e-03 8.86740706e+01
1716.lowfreq: -5.7768 -4.4074 -0.0009 -0.0006 -0.0004 10.7481 69.2172 77.9977 146.2453
frequency: 69.2087 77.9765 146.2453 149.6051 159.8721 202.9014 228.6879 287.9728 292.3283 295.9137 340.5407 393.0463 424.4987 451.8642 463.1128 508.9340 518.7045 538.2615 577.6487 605.1444 619.5777 660.2408 724.2438 725.0376 749.9415 768.9180 770.6343 796.7717 798.4642 822.3354 829.2324 856.7846 860.2660 895.0456 902.2704 906.2120 918.2539 955.1553 981.5175 981.9992 1011.5321 1021.9241 1027.8166 1063.6494 1069.6161 1083.8040 1134.5703 1145.8786 1148.6327 1150.6521 1168.6210 1179.5861 1184.3167 1201.9010 1213.0144 1219.9049 1230.3349 1247.3981 1257.5961 1276.0563 1368.4055 1385.1909 1412.1530 1421.5663 1433.2926 1437.1882 1438.6109 1447.7758 1454.6264 1459.4534 1497.2973 1545.9332 1593.2312 1611.5345 1629.8134 1636.4719 2993.0549 3005.4047 3007.9698 3014.3112 3052.9260 3064.2437 3074.9673 3082.9345 3112.2882 3117.5929 3127.0727 3138.2458 3149.8368 3166.8552
redmass: 3.7996 3.5387 4.4487 3.2841 2.3084 2.2137 3.0461 3.1627 4.4498 3.7499 5.8690 2.9598 4.4592 5.4940 3.1949 4.2826 5.5299 3.2986 3.3698 6.0967 3.1416 6.0406 2.7604 6.1951 1.1669 5.5285 1.2083 4.5984 1.4284 3.7714 1.9923 1.6716 4.2867 1.5139 3.5387 1.6303 3.5870 1.3514 3.9193 1.4177 4.2455 2.0525 2.1336 1.1659 1.1827 3.7021 1.5701 1.1461 1.6671 1.1367 1.6738 1.3926 1.3241 1.4919 1.6083 1.6605 2.2758 2.0117 2.6713 2.5379 4.5784 3.1454 3.9676 2.8431 3.9984 1.1364 1.1024 1.4842 1.3527 1.9838 3.7538 6.6863 8.0788 8.0762 7.5966 7.8576 1.0572 1.0567 1.0605 1.0617 1.1063 1.1064 1.1054 1.1053 1.0861 1.0877 1.0929 1.0979 1.0968 1.0913
irintensity: 0.0328 1.7279 0.3850 5.5217 0.0215 0.5514 1.6662 1.2428 3.5612 9.2566 0.7814 3.7604 1.2288 0.8257 0.5472 1.4849 0.2562 10.2158 0.0078 1.0728 0.2608 2.9327 9.3325 0.9226 1.4798 0.5845 0.0692 1.8539 8.7502 1.2821 3.9343 31.4897 0.9985 55.2129 2.5790 20.0450 2.8082 2.0288 1.7567 0.0013 2.0739 0.2458 0.0802 0.1810 3.0949 0.4443 3.4626 0.1170 3.2886 0.0081 0.4590 3.6947 0.4623 10.1770 11.2154 8.7570 4.2406 7.8078 2.6208 11.8367 8.8964 2.4371 5.4784 3.8717 3.3909 7.5306 3.4182 20.9914 3.1580 14.3312 10.6589 0.5453 0.8827 3.1252 2.3224 0.3511 28.6255 28.5737 84.5214 98.1953 2.9521 0.0951 38.2825 41.9811 0.6849 7.6824 12.2378 39.4368 31.1424 5.4796
temp: 298.150 k
press: 1.00000 atm
elementType: 6 6 6 6 6 6 6 6 6 6 6 6 6 6 6 6 6 6 1 1 1 1 1 1 1 1 1 1 1 1 1 1
symmnumber: 1
zpe: 676921.4 jmol-1
zpe.correction: 0.257826 hartree
zpe.thermalcorrener: 0.270991 hartree
zpe.thermalcorrenthalpy: 0.271935 hartree
zpe.thermalcorrgfe: 0.218562 hartree
zpe.sumelectzpe: -693.062484 hartree
zpe.sumelectthermal: -693.049319 hartree
zpe.sumelectthermalent: -693.048374 hartree
zpe.sumelectthermalfe: -693.101748 hartree
dipole: 0.5846 -0.9829 -0.0001
dipole: 1.1436
quadrupole: -89.9913 -92.4807 -109.0670
quadrupole: 0.0922 0.0004 -0.0006
quadrupole: 7.1884 4.6990 -11.8874 0.0922 0.0004 -0.0006
hfenergy: -693.3203098 hartree
pointgroup: C01 [X(C18H14)]
dipole: 0.2300084 -0.3866766 -0.0000311 debye
polarizability: 312.0696382|-3.6333414|215.6458967|0.0007841|-0.0041164|88.6740706 unknown
InChI: InChI=1S/C18H14/c1-2-12-3-6-15-9-13-4-5-14(13)10-17(15)18(12)16-8-7-11(1)16/h1-3,6,9-10H,4-5,7-8H2
charge 0 multiplicity 1
32 atoms
C  -1.802412 -0.994883 -0.000014
C  -0.950319 0.141662 -0.000053
C  -1.815866 -2.534472 -0.000007
C  -3.206861 -0.905269 -0.000035
C  -3.407676 -2.428226 -0.000136
C  2.615577 -1.079517 0.000007
C  0.510496 0.105614 -0.000056
C  3.330809 0.155071 -0.000067
C  3.90056 -1.923783 0.000119
C  4.702556 -0.539161 -0.000101
C  1.242171 1.361095 -0.000101
C  1.226821 -1.141965 -0.000007
C  -1.650766 1.41432 -0.00009
C  2.680925 1.382516 -0.000112
C  -3.895277 0.328747 -0.00006
C  -3.084619 1.47955 -0.000087
C  0.505581 2.606132 -0.00015
C  -0.876034 2.634021 -0.000133
H  -1.392579 -3.019167 -0.898869
H  -1.39276 -3.019119 0.89897
H  -3.894632 -2.848166 0.897886
H  -3.894449 -2.848011 -0.898336
H  4.064119 -2.545622 0.89792
H  4.064115 -2.545928 -0.897461
H  5.323051 -0.370657 -0.897795
H  5.323245 -0.370456 0.897412
H  0.683236 -2.090272 0.000079
H  3.206993 2.344349 -0.000175
H  -4.987812 0.402065 -0.000082
H  -3.547551 2.474265 -0.000125
H  1.076808 3.542411 -0.000196
H  -1.410751 3.591557 -0.000144
