program: Gaussian 09
title: 000149412
version: EM64L-G09RevD.01
frameworkgroup: C1[X(C15H17N)]
method: RPBEPBE
basis: SDD
operation: Freq
keyword: #pfreq=noraman
keyword: PBEPBE/SDD
title: #p freq=noraman PBEPBE/SDD
converged: YES YES NO NO
title: Mulliken charges:
elementType: N C C C C C C C C C C C C C C C H H H H H H H H H H H H H H H H H
charge: -0.156203 0.435404 -0.386264 0.371101 -0.375688 -0.383337 -0.422529 -0.412665 0.335176 -0.659515 -0.665366 -0.397601 -0.396756 -0.239099 -0.239442 -0.249599 0.222960 0.213336 0.221867 0.233604 0.228716 0.229018 0.234480 0.221107 0.231285 0.219654 0.243155 0.213295 0.232183 0.231406 0.220459 0.220410 0.225443
chargesum: 0.00000
title: Mulliken charges with hydrogens summed into heavy atoms:
elementType: N C C C C C C C C C C C C C C C
charge: -0.156203 0.435404 0.050032 0.371101 -0.153821 -0.149732 -0.193813 -0.183647 0.335176 0.027357 0.010739 -0.165418 -0.165350 -0.018639 -0.019032 -0.024155
polarizability: 3.14911047e+02 4.93899774e+00 1.60833035e+02 -3.09121839e+00 1.59686044e+00 8.79293098e+01
1716.lowfreq: -9.7161 -1.7174 -0.0010 -0.0008 -0.0008 5.6166 32.3870 46.6071 65.6363
frequency: 32.3039 46.2803 65.5650 77.2427 103.2330 125.1561 168.0975 196.1342 214.7990 243.3346 265.2490 307.3719 388.7338 405.9950 412.2304 419.9240 435.4873 493.2087 506.4951 548.1727 550.8055 614.5875 638.5273 674.0911 700.4159 726.4894 755.9411 768.6623 783.2533 804.3264 819.3032 845.8823 887.9697 910.7306 938.6740 949.2927 969.8588 981.1710 987.6530 988.4742 992.6788 1016.2858 1041.8951 1066.8821 1080.7561 1083.9573 1108.9416 1137.2749 1159.7135 1171.4094 1191.7459 1215.2256 1233.4452 1280.8795 1297.3915 1306.9107 1323.6827 1342.2515 1361.6785 1374.6646 1378.0173 1381.2748 1431.0833 1441.1051 1447.6890 1464.4286 1470.5899 1477.2162 1481.1087 1493.4723 1504.8600 1532.7209 1552.8536 1583.6211 1611.1071 1633.1308 2940.0961 2982.2516 2992.8659 3005.2822 3041.6186 3078.6670 3090.6054 3093.8553 3117.8081 3121.6661 3126.9142 3127.8035 3137.9785 3144.8541 3159.4565 3161.7176 3164.9135
redmass: 3.5477 3.3541 3.3126 3.1953 3.4267 3.5167 1.9547 1.0979 1.5466 4.3075 3.3067 3.9069 3.4530 2.8449 4.2098 3.0820 2.8987 3.2160 3.1353 2.3258 3.7057 6.4849 6.9184 4.8413 1.7268 3.0769 4.9493 1.9722 1.1688 1.2612 1.8256 1.2534 2.3722 1.4364 1.3866 1.3639 1.4234 4.5272 4.5999 1.3521 3.3003 2.9602 1.9034 1.8757 1.6422 1.6196 1.2930 1.5275 1.8570 1.0532 1.1159 1.1179 2.2559 1.4319 2.8154 1.4827 1.3543 1.3078 2.9637 7.3050 2.3303 1.2237 2.9367 2.2306 1.3847 1.0508 1.0541 1.0655 2.0739 1.0938 1.1177 2.9404 5.9207 6.2199 5.9854 6.2708 1.0388 1.0354 1.0611 1.0997 1.1020 1.0994 1.0996 1.0969 1.0841 1.0874 1.0876 1.0880 1.0914 1.0961 1.0932 1.1011 1.0945
irintensity: 0.8269 0.4342 0.7989 0.9949 1.0996 1.0207 1.5391 0.0971 0.4400 0.0481 0.8816 0.5992 11.7193 0.0035 0.3235 1.3467 0.9237 1.4815 15.6124 5.1839 7.1021 0.0510 0.5030 2.5690 48.0045 11.7283 1.6825 84.7744 10.5861 2.2092 54.4677 0.0169 1.4761 2.4444 0.4429 0.4263 0.0867 9.6598 1.7290 0.1742 22.9483 0.4949 10.1993 16.6575 34.0305 5.5246 5.9506 1.2992 15.1087 0.0341 2.2184 49.2911 34.0685 50.1923 14.4318 9.5208 4.1660 63.7961 14.5863 2.3673 100.8510 22.9990 1.4451 10.4771 10.2901 7.1430 23.3723 7.6173 120.2531 15.7788 43.4280 168.5354 2.0111 3.8513 102.7744 231.4758 107.2180 30.6173 62.1231 47.7917 11.9939 50.5676 11.9230 64.3539 13.5041 2.8279 5.2036 21.7834 9.6576 47.2763 35.5746 37.5810 6.3110
temp: 298.150 k
press: 1.00000 atm
elementType: 7 6 6 6 6 6 6 6 6 6 6 6 6 6 6 6 1 1 1 1 1 1 1 1 1 1 1 1 1 1 1 1 1
symmnumber: 1
zpe: 729192.3 jmol-1
zpe.correction: 0.277735 hartree
zpe.thermalcorrener: 0.292628 hartree
zpe.thermalcorrenthalpy: 0.293572 hartree
zpe.thermalcorrgfe: 0.234866 hartree
zpe.sumelectzpe: -635.391277 hartree
zpe.sumelectthermal: -635.376384 hartree
zpe.sumelectthermalent: -635.375440 hartree
zpe.sumelectthermalfe: -635.434146 hartree
dipole: 3.4967 0.1333 0.1103
dipole: 3.5009
quadrupole: -76.2952 -85.8447 -102.2164
quadrupole: 0.9090 -0.3973 1.3133
quadrupole: 11.8236 2.2740 -14.0976 0.9090 -0.3973 1.3133
hfenergy: -635.6690117 hartree
pointgroup: C01 [X(C15H17N1)]
dipole: 1.3761142 -0.0433995 -0.0397772 debye
polarizability: 315.0300109|-2.400745|158.4755962|2.9094044|-12.7217631|90.1677847 unknown
InChI: InChI=1S/C15H17N/c1-3-16(2)15-11-9-14(10-12-15)13-7-5-4-6-8-13/h4-12H,3H2,1-2H3
charge 0 multiplicity 1
33 atoms
N  3.590892 -0.305141 0.281205
C  2.193777 -0.215889 0.199497
C  4.435395 0.900623 0.374047
C  -0.703343 -0.067051 0.081448
C  1.50313 1.035589 0.293189
C  1.388764 -1.387611 0.028021
C  0.100617 1.095868 0.238978
C  -0.013452 -1.305383 -0.02422
C  -2.188018 0.008842 0.02352
C  4.250675 -1.600543 0.074034
C  4.697032 1.593269 -0.985805
C  -2.999522 -1.064109 0.492238
C  -2.849144 1.155771 -0.502524
C  -4.407549 -0.996146 0.433748
C  -4.257198 1.228883 -0.554883
C  -5.047492 0.15217 -0.088824
H  3.97362 1.616286 1.079686
H  5.399315 0.604807 0.82833
H  2.058811 1.969485 0.417436
H  1.858905 -2.369588 -0.074586
H  -0.382752 2.073778 0.349487
H  -0.583952 -2.22784 -0.18478
H  3.939167 -2.34207 0.836693
H  5.341726 -1.469903 0.158297
H  4.034747 -2.030267 -0.926475
H  5.223521 0.912812 -1.679153
H  3.748922 1.897474 -1.462427
H  5.321892 2.495586 -0.848247
H  -2.522612 -1.94641 0.934416
H  -2.253958 1.984674 -0.902589
H  -5.006716 -1.834546 0.807721
H  -4.738518 2.121475 -0.97125
H  -6.140981 0.206904 -0.131828
