program: Gaussian 09
title: 000149403
version: EM64L-G09RevD.01
frameworkgroup: C1[X(C14H14O2)]
method: RPBEPBE
basis: SDD
operation: Freq
keyword: #pfreq=noraman
keyword: PBEPBE/SDD
title: #p freq=noraman PBEPBE/SDD
converged: YES YES NO NO
title: Mulliken charges:
elementType: O O C C C C C C C C C C C C C C H H H H H H H H H H H H H H
charge: -0.304385 -0.274853 -0.039052 -0.348711 -0.265547 -0.449770 0.413946 0.170651 0.406380 -0.472786 -0.358507 -0.446520 -0.242315 -0.434017 -0.259452 -0.241718 0.247751 0.215961 0.225898 0.201694 0.196101 0.212387 0.198124 0.233123 0.258462 0.238952 0.228577 0.236662 0.225034 0.227930
chargesum: 0.00000
title: Mulliken charges with hydrogens summed into heavy atoms:
elementType: O O C C C C C C C C C C C C C C
charge: -0.304385 -0.274853 0.208699 0.093148 0.132248 -0.039260 0.413946 0.170651 0.406380 -0.239663 -0.100045 -0.207568 -0.013738 -0.197354 -0.034417 -0.013788
polarizability: 1.86153838e+02 -6.61604111e-01 1.97311060e+02 -2.01709444e+01 5.24925922e+00 8.75715312e+01
1716.lowfreq: -11.8722 -6.5204 -3.9681 -0.0006 0.0001 0.0005 21.4833 27.2674 51.0566
frequency: 20.9238 27.2318 51.0076 80.4274 114.4889 134.8915 175.5306 185.3289 247.3503 269.3649 306.4257 395.3808 406.1119 421.0427 455.8396 473.0875 499.4913 514.1252 554.6595 605.8547 649.7684 709.5676 743.0559 746.1936 783.6611 790.6726 794.9189 811.8710 864.3591 876.2370 890.8176 907.2870 924.6600 959.0152 966.9140 977.4521 985.3397 992.9498 1019.2787 1024.4152 1027.7427 1062.3922 1082.3268 1097.9896 1110.5475 1139.0024 1150.6029 1173.9638 1182.3408 1196.6627 1202.0880 1237.8575 1238.6275 1254.1062 1279.1292 1324.7836 1376.1038 1381.4022 1408.4682 1420.8649 1422.8659 1443.2211 1457.8542 1471.4172 1480.1579 1486.3779 1518.2749 1591.5283 1601.5890 1635.4836 2916.3799 2929.9442 2975.6024 2981.0683 3067.7445 3115.8440 3120.2897 3121.2094 3128.7456 3133.0173 3152.3501 3157.1182 3166.7988 3176.8404
redmass: 4.5279 3.3677 4.2590 3.6191 4.8661 3.7542 4.2305 5.0588 4.3483 2.8807 3.9359 2.5427 3.4160 3.3148 3.8480 3.2863 6.0881 4.6474 4.0990 4.2415 3.8510 4.2054 1.8477 2.8659 3.1251 2.8943 3.8864 1.5627 2.2055 2.8520 1.2707 2.6207 1.7648 1.3924 1.8376 1.9126 1.4047 1.3689 6.4920 2.1030 1.6888 2.5994 2.1402 1.3640 1.3280 1.5092 1.4147 1.1186 1.2261 1.1920 1.2227 1.7194 1.5029 1.6738 1.7432 1.2637 1.7984 1.8073 2.9557 3.6982 2.1580 2.4334 2.6489 1.1634 1.1681 1.0994 3.9380 7.3249 5.4414 6.6371 1.0592 1.0554 1.1011 1.1063 1.0532 1.0917 1.0864 1.0861 1.0915 1.0893 1.0952 1.0990 1.0990 1.1188
irintensity: 0.1051 1.7110 0.3932 1.7186 4.4309 9.0711 5.5913 6.6495 3.0584 0.7279 4.8185 1.7982 1.0362 6.8166 4.8138 0.1052 1.7932 4.3406 6.1972 4.7463 1.5847 1.2685 3.1119 4.2358 23.0863 39.6585 46.7763 78.8390 3.3847 10.6387 2.4115 6.2309 5.6057 2.3100 3.6882 5.7144 0.7665 1.6211 203.4533 6.1807 3.1617 6.5254 3.4280 6.3686 11.1656 4.7185 2.1281 4.7589 1.8339 4.5426 5.1936 2.5262 4.0950 4.7275 0.6059 41.9877 1.7083 10.8182 1.6861 0.7693 0.4793 2.5103 0.3513 5.6118 3.2570 8.1338 11.3403 0.8350 2.4670 0.0613 35.8136 91.4700 68.3090 16.4248 22.8941 14.6154 2.3929 0.9242 17.6836 13.9284 31.9490 37.0215 19.4699 32.5233
temp: 298.150 k
press: 1.00000 atm
elementType: 8 8 6 6 6 6 6 6 6 6 6 6 6 6 6 6 1 1 1 1 1 1 1 1 1 1 1 1 1 1
symmnumber: 1
zpe: 633756.0 jmol-1
zpe.correction: 0.241385 hartree
zpe.thermalcorrener: 0.255416 hartree
zpe.thermalcorrenthalpy: 0.256360 hartree
zpe.thermalcorrgfe: 0.198090 hartree
zpe.sumelectzpe: -691.123632 hartree
zpe.sumelectthermal: -691.109601 hartree
zpe.sumelectthermalent: -691.108657 hartree
zpe.sumelectthermalfe: -691.166927 hartree
dipole: 1.9677 -0.0070 0.5372
dipole: 2.0398
quadrupole: -103.7344 -80.3769 -94.9315
quadrupole: -1.5930 -2.5340 -0.7448
quadrupole: -10.7201 12.6374 -1.9172 -1.5930 -2.5340 -0.7448
hfenergy: -691.3650172 hartree
pointgroup: C01 [X(C14H14O2)]
dipole: -0.7766149 -0.0418978 -0.1978198 debye
polarizability: 184.968707|2.6160904|197.1569178|-22.1773764|8.2654061|88.9108042 unknown
InChI: InChI=1S/C14H14O2/c1-2-7-14-11(4-1)5-3-6-12(14)8-15-9-13-10-16-13/h1-7,13H,8-10H2
charge 0 multiplicity 1
30 atoms
O  5.372815 0.651394 0.130776
O  1.79877 -0.522229 -0.06273
C  4.027458 0.102653 0.553603
C  4.31808 1.559086 0.726039
C  3.167001 -0.395316 -0.586532
C  0.885934 -1.102533 -1.073686
C  -0.50951 -1.206655 -0.501379
C  -1.275846 -0.02335 -0.183558
C  -2.636243 -0.174899 0.296577
C  -1.0851 -2.470057 -0.320665
C  -0.746041 1.302931 -0.32833
C  -3.184492 -1.49001 0.462365
C  -2.421594 -2.618533 0.164025
C  -3.410428 0.99527 0.595241
C  -1.526126 2.423859 -0.034544
C  -2.870758 2.271842 0.430156
H  4.063804 -0.548239 1.435982
H  3.879908 2.277136 0.021193
H  4.553922 1.948418 1.723297
H  3.536819 -1.381362 -0.945528
H  3.206079 0.319204 -1.438112
H  1.253181 -2.108964 -1.366082
H  0.89895 -0.455888 -1.980618
H  -0.499768 -3.366832 -0.557208
H  0.294603 1.426036 -0.642606
H  -4.213033 -1.593373 0.828435
H  -2.840826 -3.621918 0.294491
H  -4.437843 0.86894 0.95762
H  -1.106358 3.429594 -0.148981
H  -3.469857 3.159895 0.659854
