program: Gaussian 09
title: 000149401
version: EM64L-G09RevD.01
frameworkgroup: C1[X(C9H17N3O3)]
method: RPBEPBE
basis: SDD
operation: Freq
keyword: #p
keyword: freq=noraman
keyword: PBEPBE/SDD
title: #p freq=noraman PBEPBE/SDD
converged: YES YES NO NO
title: Mulliken charges:
elementType: O O O N N N C C C C C C C C C H H H H H H H H H H H H H H H H H
charge: -0.267337 -0.450074 -0.263797 -0.413151 -0.156299 0.022916 -0.044435 -0.421230 -0.448647 -0.398926 -0.415239 -0.377383 0.351295 -0.382497 -0.299275 0.255665 0.239427 0.196930 0.202887 0.219848 0.205301 0.204725 0.209885 0.192812 0.193063 0.204522 0.342704 0.276289 0.236733 0.200544 0.230138 0.352603
chargesum: 0.00000
title: Mulliken charges with hydrogens summed into heavy atoms:
elementType: O O O N N N C C C C C C C C C
charge: -0.267337 -0.097471 -0.263797 -0.070447 -0.156299 0.022916 0.211231 0.015127 -0.025912 0.011100 -0.012542 0.020203 0.351295 0.130526 0.131408
polarizability: 1.52246794e+02 -5.25539447e+00 1.27696884e+02 5.22646853e+00 3.53355353e+00 1.04437329e+02
1716.lowfreq: -10.1202 -5.1358 -1.6194 -0.0007 0.0005 0.0009 20.6900 37.9364 55.7066
frequency: 20.5136 37.7792 55.7015 58.8464 75.8884 96.5529 160.7266 172.7661 205.7977 223.8913 238.0178 258.6441 283.7493 324.5419 355.6198 367.9567 381.2718 426.2204 454.1995 478.1160 488.2783 522.9972 636.4354 658.4784 708.7638 746.5453 771.7974 780.4552 812.6299 830.1484 845.6155 861.8890 879.3318 922.6089 944.4373 971.4329 984.4703 1011.2125 1030.9797 1045.4186 1053.4560 1087.9022 1103.7078 1114.2098 1128.7677 1153.0267 1166.0179 1197.1497 1235.0741 1243.5378 1245.0454 1258.1836 1272.7662 1301.8296 1316.1897 1329.1253 1331.0132 1336.9356 1343.8394 1350.5776 1355.7793 1366.1209 1368.0827 1402.0000 1427.1508 1453.4997 1458.9638 1465.8823 1469.8642 1472.2461 1482.7222 1492.7102 1669.4585 2957.1061 2958.9942 2966.3935 2972.4424 2980.1498 2985.1900 3024.2331 3024.3544 3029.9781 3031.3239 3032.0829 3039.7291 3046.4300 3053.2892 3112.0088 3506.0312 3579.0436
redmass: 4.3817 4.7276 4.8780 5.1933 3.6354 6.7225 3.5933 2.7094 2.2843 3.5657 1.4414 4.5590 3.2425 2.6984 2.0628 2.9215 4.0550 3.5687 3.0816 2.2831 4.6894 2.7760 2.3620 1.1454 9.7233 5.3350 1.5369 3.7287 3.3248 1.6385 2.7409 2.3631 2.3757 1.4790 2.6155 2.7617 2.1413 2.8575 3.4014 1.5169 1.6387 1.7132 1.8777 1.0452 2.4319 1.8734 2.0960 1.2284 1.4220 1.8637 1.6209 1.2745 1.3091 1.6231 1.3186 1.4021 1.4598 1.4419 6.5196 1.4294 1.4721 1.3532 1.3380 1.4317 1.1009 1.0913 1.0976 1.0919 1.2640 1.1632 1.0816 1.3778 10.2535 1.0601 1.0673 1.0626 1.0627 1.0632 1.0620 1.0847 1.0769 1.0947 1.0885 1.0960 1.1002 1.1018 1.1015 1.1007 1.0770 1.0667
irintensity: 0.3165 4.0441 1.7385 3.0403 2.9271 8.6279 3.0993 36.1229 18.3007 9.0448 98.6653 2.1563 25.7444 9.2166 9.1470 2.3005 8.2145 5.8494 4.0185 2.0210 2.2532 10.5150 6.6247 75.6682 17.1158 43.6651 1.1223 13.3765 7.8012 5.3139 26.4436 8.1473 10.8637 10.8683 16.3100 215.7313 6.9201 1.7978 32.2105 1.5427 1.1046 0.4808 45.4589 3.5289 12.4195 3.3831 16.3298 30.1374 13.4262 24.7936 8.3215 3.9230 10.6072 5.1470 12.3237 8.3532 18.5022 3.2359 124.1064 0.9399 2.7983 16.9811 3.6582 3.2250 33.2828 21.5221 11.7577 21.2189 113.8993 134.5614 7.5808 241.9329 240.0461 70.1120 23.7402 39.2239 28.8753 20.7911 24.5816 26.6643 29.3107 75.6331 37.6877 37.3039 34.7964 35.7644 79.3431 1.5557 34.9145 4.9590
temp: 298.150 k
press: 1.00000 atm
elementType: 8 8 8 7 7 7 6 6 6 6 6 6 6 6 6 1 1 1 1 1 1 1 1 1 1 1 1 1 1 1 1 1
symmnumber: 1
zpe: 699111.7 jmol-1
zpe.correction: 0.266278 hartree
zpe.thermalcorrener: 0.282053 hartree
zpe.thermalcorrenthalpy: 0.282997 hartree
zpe.thermalcorrgfe: 0.221435 hartree
zpe.sumelectzpe: -741.836862 hartree
zpe.sumelectthermal: -741.821087 hartree
zpe.sumelectthermalent: -741.820143 hartree
zpe.sumelectthermalfe: -741.881705 hartree
dipole: 0.3846 0.2254 1.2807
dipole: 1.3561
quadrupole: -68.3732 -104.9709 -85.2931
quadrupole: 1.5344 -1.8840 -1.9112
quadrupole: 17.8392 -18.7585 0.9193 1.5344 -1.8840 -1.9112
hfenergy: -742.1031399 hartree
pointgroup: C01 [X(C9H17N3O3)]
dipole: -0.1609185 -0.0313221 0.5077026 debye
polarizability: 152.5248629|-5.4326625|126.4516979|-3.602899|-6.2700106|105.4044457 unknown
InChI: InChI=1S/C9H17N3O3/c13-7-6-12(11-15)9(14)10-8-4-2-1-3-5-8/h8,10,13H,1-7H2
charge 0 multiplicity 1
32 atoms
O  0.784187 1.761357 -0.982869
O  3.565637 1.254392 1.232351
O  2.389215 -2.408258 0.12766
N  -0.520538 0.234121 0.226591
N  1.718491 -0.313754 -0.346629
N  1.409523 -1.576601 0.130673
C  -1.749827 1.061884 0.245696
C  -2.526431 0.959278 -1.096935
C  -2.641123 0.628338 1.435264
C  -3.1422 -0.443549 -1.305613
C  -3.274093 -0.770984 1.226743
C  -4.045167 -0.845265 -0.113871
C  0.61864 0.659109 -0.394415
C  3.069539 0.065768 -0.806813
C  4.076163 0.200764 0.345893
H  -1.422249 2.109047 0.383519
H  -1.847201 1.224852 -1.927663
H  -3.332746 1.720735 -1.082476
H  -3.45296 1.375358 1.533938
H  -2.055872 0.660928 2.374296
H  -2.328871 -1.189308 -1.4191
H  -3.721806 -0.462585 -2.248156
H  -3.949784 -0.999885 2.072767
H  -2.490302 -1.557981 1.24103
H  -4.915798 -0.158175 -0.069244
H  -4.449009 -1.864847 -0.264588
H  -0.516068 -0.706778 0.631314
H  2.952774 1.030468 -1.325167
H  3.430617 -0.706609 -1.51022
H  5.05448 0.483917 -0.097825
H  4.186978 -0.763829 0.877757
H  4.151301 1.335391 2.02569
