program: Gaussian 09
title: 000149402
version: EM64L-G09RevD.01
frameworkgroup: C1[X(C9H9ClN4O4)]
method: RPBEPBE
basis: SDD
operation: Freq
keyword: #p
keyword: freq=noraman
keyword: PBEPBE/SDD
title: #p freq=noraman PBEPBE/SDD
converged: NO YES NO NO
title: Mulliken charges:
elementType: Cl O O O O N N N N C C C C C C C C C H H H H H H H H H
charge: -0.028261 -0.238007 -0.210956 -0.207537 -0.214236 -0.191327 -0.474063 0.022304 0.042498 0.507139 -0.332825 0.316896 -0.420357 -0.311573 0.393810 -0.341355 -0.357998 -0.569302 0.278510 0.274755 0.356071 0.243460 0.308782 0.291091 0.290135 0.280613 0.291732
chargesum: 0.00000
title: Mulliken charges with hydrogens summed into heavy atoms:
elementType: Cl O O O O N N N N C C C C C C C C C
charge: -0.028261 -0.238007 -0.210956 -0.207537 -0.214236 -0.191327 -0.117992 0.022304 0.042498 0.507139 0.220441 0.316896 -0.176896 -0.002791 0.393810 -0.050264 -0.067864 0.003043
polarizability: 2.93196507e+02 8.99782668e+00 1.61605551e+02 -1.01217477e+01 1.12845689e+01 6.94376126e+01
1716.lowfreq: -4.3121 -0.0022 -0.0018 -0.0008 1.5482 7.2534 21.8882 27.0878 39.2637
frequency: 21.8039 27.0779 39.2539 58.1377 66.1103 80.7159 90.5121 124.7341 153.3816 176.3884 192.2004 232.5007 251.5047 318.5062 323.9694 334.7621 371.9693 416.3902 418.1857 467.6626 486.0891 507.6221 512.2645 624.3580 642.6761 667.0063 688.7202 705.5752 735.1414 737.1686 772.3988 792.4973 793.6778 832.5246 848.6187 849.1526 879.1855 920.5751 984.2380 1000.3231 1008.3067 1038.2507 1051.1660 1085.6985 1097.7195 1123.0076 1183.0536 1208.3747 1224.0532 1242.1222 1268.8275 1274.7415 1305.0354 1325.6772 1358.7872 1362.3806 1385.7795 1402.2146 1428.7773 1438.6393 1456.0220 1487.6387 1528.3468 1600.0026 1613.7419 1657.3871 3045.5896 3069.3604 3119.7560 3137.0299 3158.3492 3179.7401 3187.1732 3202.0765 3425.5841
redmass: 5.9484 9.9729 9.8772 2.9319 9.4251 6.3215 8.3502 8.2857 6.6620 11.4330 9.9038 8.0318 9.7599 6.3351 4.0374 4.2664 8.3507 3.3235 6.5175 11.2335 9.6178 3.2111 7.1862 7.1794 8.0361 4.6666 6.7360 6.4639 2.2074 4.2726 4.4413 1.8798 1.6272 5.1245 4.5717 1.3200 1.5565 2.9668 1.3457 3.1906 1.3268 2.2206 2.5211 3.7275 2.8078 1.3055 1.4739 1.8055 4.0133 2.4090 1.1761 2.6049 1.3588 1.2483 1.6320 3.3861 7.4529 7.4589 4.1589 1.1435 1.0931 2.4227 2.2563 6.0598 5.7585 8.5362 1.0594 1.0558 1.1049 1.0911 1.1129 1.0905 1.0948 1.0960 1.0765
irintensity: 0.3687 0.3565 0.9642 2.1536 2.7116 1.0493 1.2526 6.9255 3.0472 9.2403 3.6161 3.2379 3.9175 0.8497 9.3633 3.7604 31.4207 1.1148 5.5832 0.5339 7.1455 18.4077 0.0639 0.5248 2.6797 27.0576 19.9620 61.7341 2.2143 0.5495 109.8641 80.3878 64.9253 10.0548 34.1390 43.9194 94.5089 183.8420 0.2976 0.1521 0.0543 78.9695 17.0110 35.3484 42.2489 18.3223 209.7847 8.2541 459.2178 45.1318 5.7640 2.7186 19.4813 26.4444 28.9831 98.9326 200.7450 134.3950 77.7567 35.3270 10.3366 0.3751 820.2814 94.0620 166.4581 168.2591 1.2989 12.4064 1.3553 7.7050 2.4964 1.9299 3.0061 2.6418 101.2862
temp: 298.150 k
press: 1.00000 atm
elementType: 17 8 8 8 8 7 7 7 7 6 6 6 6 6 6 6 6 6 1 1 1 1 1 1 1 1 1
symmnumber: 1
zpe: 489428.1 jmol-1
zpe.correction: 0.186413 hartree
zpe.thermalcorrener: 0.203350 hartree
zpe.thermalcorrenthalpy: 0.204294 hartree
zpe.thermalcorrgfe: 0.138111 hartree
zpe.sumelectzpe: -1326.878246 hartree
zpe.sumelectthermal: -1326.861309 hartree
zpe.sumelectthermalent: -1326.860365 hartree
zpe.sumelectthermalfe: -1326.926548 hartree
dipole: 3.3500 2.1981 0.1093
dipole: 4.0082
quadrupole: -165.1999 -115.7758 -108.4362
quadrupole: -6.9291 0.7274 -0.1510
quadrupole: -35.3959 14.0281 21.3678 -6.9291 0.7274 -0.1510
hfenergy: -1327.0646591 hartree
pointgroup: C01 [X(C9H9Cl1N4O4)]
dipole: -1.3677475 0.7829965 -0.0545547 debye
polarizability: 293.9790677|-0.7622578|161.0933542|-7.0029897|-11.5220861|69.1672486 unknown
InChI: InChI=1S/C9H9ClN4O4/c10-5-6-13(12-16)9(15)11-7-1-3-8(4-2-7)14(17)18/h1-4,11H,5-6H2
charge 0 multiplicity 1
27 atoms
Cl -6.286167 -1.93996 -0.407414
O  -1.569235 -1.485918 0.461142
O  5.777727 0.762103 -0.297035
O  5.460639 -1.471386 0.054499
O  -4.117762 2.318322 -0.018867
N  -2.945718 0.402754 0.258485
N  -0.601305 0.644917 0.081446
N  5.019708 -0.266723 -0.100316
N  -2.961918 1.789339 0.013885
C  0.783903 0.356459 0.044603
C  -4.173814 -0.38829 0.500082
C  -1.642467 -0.24418 0.276963
C  1.663285 1.456031 -0.170517
C  1.31127 -0.954741 0.21188
C  3.557998 -0.050436 -0.050437
C  3.050622 1.257778 -0.218719
C  2.701932 -1.152776 0.163083
C  -4.725337 -0.972283 -0.812363
H  -3.918973 -1.20129 1.19701
H  -4.915945 0.28789 0.957404
H  -0.895282 1.622623 -0.050358
H  1.255593 2.465541 -0.298567
H  0.634887 -1.79462 0.377107
H  3.743429 2.086953 -0.382076
H  3.134435 -2.148879 0.28827
H  -5.027137 -0.192712 -1.526309
H  -4.029866 -1.691217 -1.26778
