program: Gaussian 09
title: 000149487
version: EM64L-G09RevD.01
frameworkgroup: C1[X(C21H20N4O4S2)]
method: RPBEPBE
basis: SDD
operation: Freq
keyword: #p
keyword: freq=noraman
keyword: PBEPBE/SDD
title: #p freq=noraman PBEPBE/SDD
converged: YES YES NO NO
title: Mulliken charges:
elementType: S S O O O O N N N N C C C C C C C C C C C C C C C C C C C C C H H H H H H H H H H H H H H H H H H H H
charge: 1.021976 0.987819 -0.534427 -0.524040 -0.541380 -0.531554 -0.506682 -0.041886 -0.613990 -0.511152 0.231693 0.247868 0.234143 -0.030766 -0.112744 -0.389622 -0.541700 0.449955 0.454966 -0.402116 -0.335301 -0.310821 -0.259968 -0.435502 -0.335829 -0.234070 0.295700 -0.349479 -0.321044 -0.739749 -0.759864 0.309031 0.230991 0.270201 0.304205 0.267510 0.267792 0.315479 0.236239 0.234541 0.274062 0.237097 0.230968 0.292054 0.276945 0.297105 0.284078 0.272317 0.263371 0.297242 0.278340
chargesum: 0.00000
title: Mulliken charges with hydrogens summed into heavy atoms:
elementType: S S O O O O N N N N C C C C C C C C C C C C C C C C C C C C C
charge: 1.021976 0.987819 -0.534427 -0.524040 -0.541380 -0.531554 -0.197651 -0.041886 -0.298512 -0.234207 0.231693 0.247868 0.234143 -0.030766 -0.112744 -0.158631 -0.271499 0.449955 0.454966 -0.097910 -0.067791 -0.043028 -0.023730 -0.200961 -0.061767 0.003026 0.295700 -0.118511 -0.028990 0.113751 0.079089
polarizability: 6.39955624e+02 -8.99285846e+00 4.44985572e+02 -2.25524258e+00 -2.76061077e+01 2.47669590e+02
1716.lowfreq: -4.9710 0.0006 0.0011 0.0019 2.8576 7.9125 11.0084 18.6842 23.3044
frequency: 10.7104 18.6260 23.2440 29.0079 31.1027 39.5374 48.3601 65.6655 71.7342 85.4111 95.4795 112.3133 135.8555 142.5177 148.7562 156.5979 163.8414 165.4131 175.9321 186.3429 207.1742 225.1294 231.8815 244.9624 256.0046 284.3917 294.3376 311.3471 322.2642 330.9532 339.0009 360.7263 365.2683 381.4853 395.1026 405.6057 412.8911 416.6453 426.0264 470.5530 480.2334 493.9220 501.9284 525.4483 538.0713 541.7871 551.3730 557.0697 588.5650 593.1373 631.1002 635.1760 645.9445 653.1147 704.3814 723.3209 726.8940 749.3033 759.6296 775.3406 782.2306 793.9612 807.2070 811.1574 818.9625 822.5161 828.1404 840.9735 844.3662 859.6264 877.3195 887.4124 894.5629 903.7292 915.9712 934.3890 949.6114 960.6875 960.9373 967.0930 972.1938 977.1583 995.1679 997.5144 1008.3963 1018.9776 1021.8876 1081.6989 1118.5563 1125.1569 1155.5220 1175.6836 1183.4788 1194.5549 1204.7358 1228.0812 1241.9678 1247.6696 1263.1272 1276.5487 1283.1221 1291.5891 1293.8741 1300.9484 1316.7296 1350.5216 1364.9127 1378.5585 1394.5241 1407.6161 1407.7267 1417.4652 1417.6435 1428.3746 1434.3799 1446.8997 1454.3101 1476.6953 1486.1213 1499.0361 1517.6743 1545.5298 1555.1210 1574.1727 1605.4240 1611.9292 1629.6004 3029.5101 3030.3906 3114.2466 3133.2043 3136.7952 3136.9653 3147.2605 3151.2354 3159.6554 3167.6344 3168.3070 3176.4809 3179.4727 3179.9110 3181.1555 3183.9549 3185.7584 3360.2202 3437.9243 3520.6761
redmass: 8.8687 5.0240 5.6136 5.6841 6.4736 5.4352 6.2616 4.8074 5.5161 5.2769 5.2811 4.4680 8.2645 3.7082 3.1422 1.6356 1.3962 2.6026 4.0852 6.3783 5.7946 5.2653 5.1741 4.3641 4.9253 4.7372 5.9720 6.0909 6.4274 8.0552 6.3176 7.4405 5.4236 6.1646 3.3898 3.9337 3.4710 3.8445 2.9784 3.2329 2.7138 1.8362 3.7477 2.5655 3.9685 6.5492 8.3696 5.4150 6.0902 6.2267 6.4652 3.8093 5.0655 5.2603 4.7614 3.6421 2.4862 2.7708 3.7951 1.6515 3.4973 2.6762 2.4986 1.6187 8.8474 2.1717 2.7604 2.3051 1.8446 5.8244 1.6159 1.6894 2.1774 2.2101 5.0321 1.3713 1.3227 2.9702 1.3244 1.3530 1.3539 1.3486 2.6849 1.3513 2.3257 2.3543 2.1655 4.3317 1.5072 1.8146 1.3490 1.3938 1.1952 1.4512 1.2138 1.5504 2.5819 1.6330 3.0702 2.1600 1.1377 1.2218 2.1338 2.4934 1.6165 2.1910 2.2048 3.9417 4.0145 1.0570 1.0589 1.0553 1.0558 4.6185 3.5676 3.3603 3.5291 2.1033 3.1783 3.0089 6.7989 7.5365 6.6069 3.5500 5.8737 6.1511 6.4550 1.0239 1.0240 1.0869 1.0883 1.0861 1.0970 1.0919 1.0895 1.0888 1.0965 1.0952 1.0995 1.0972 1.1071 1.1076 1.1081 1.1082 1.0755 1.0766 1.0748
irintensity: 2.3127 3.9218 10.0736 4.8763 1.8513 0.4201 3.9167 7.2427 4.5775 3.6967 0.5139 5.3671 49.7788 9.4010 8.2283 6.1359 0.2968 23.8258 0.4883 12.2112 10.7642 2.1928 8.9474 4.3961 3.9186 3.1156 3.7797 10.8399 32.2609 36.7896 31.3069 9.8689 41.0099 6.7558 46.1972 29.5816 13.4987 9.2396 16.6379 17.2421 4.5805 213.7105 58.9584 21.6163 4.6744 44.7991 57.1810 17.3920 4.4460 10.0646 7.0098 35.6893 26.0727 8.0003 11.1137 26.0973 47.2124 6.3829 20.0037 68.9596 7.4659 2.4006 88.1484 16.6445 200.5324 128.1784 6.5472 19.0408 27.6431 2.1369 0.7431 23.2473 18.3918 20.9391 3.1764 0.0745 151.3206 43.9049 174.8813 2.3192 1.3297 1.9584 0.1587 0.2557 47.5813 54.7630 8.3978 7.1618 14.0588 4.2637 9.9658 20.0934 36.7072 13.0938 0.9630 1.2083 1.8481 17.6503 116.7629 10.9720 7.8936 8.8920 32.3080 25.0580 2.3592 22.0661 32.7927 194.2725 41.6818 4.1854 8.6764 21.4760 0.6218 206.4856 17.5473 120.5580 5.4248 25.4991 33.7741 420.7075 72.9376 73.0839 23.2284 25.5783 118.3771 293.6387 27.5330 0.7873 0.4726 16.6542 9.3025 5.2667 13.5651 8.0732 7.8482 7.6214 4.3862 13.5242 28.0801 2.7896 0.1203 0.2343 1.0417 0.2111 10.8277 23.6471 27.8337
temp: 298.150 k
press: 1.00000 atm
elementType: 16 16 8 8 8 8 7 7 7 7 6 6 6 6 6 6 6 6 6 6 6 6 6 6 6 6 6 6 6 6 6 1 1 1 1 1 1 1 1 1 1 1 1 1 1 1 1 1 1 1 1
symmnumber: 1
zpe: 978450.4 jmol-1
zpe.correction: 0.372672 hartree
zpe.thermalcorrener: 0.403274 hartree
zpe.thermalcorrenthalpy: 0.404218 hartree
zpe.thermalcorrgfe: 0.307188 hartree
zpe.sumelectzpe: -2125.715014 hartree
zpe.sumelectthermal: -2125.684412 hartree
zpe.sumelectthermalent: -2125.683468 hartree
zpe.sumelectthermalfe: -2125.780498 hartree
dipole: 0.7377 1.3441 2.5873
dipole: 3.0075
quadrupole: -280.8091 -191.8347 -190.0580
quadrupole: 11.3467 -49.4978 -1.2325
quadrupole: -59.9085 29.0659 30.8426 11.3467 -49.4978 -1.2325
hfenergy: -2126.087686 hartree
pointgroup: C01 [X(C21H20N4O4S2)]
dipole: 0.3476945 -0.5357095 -0.9960805 debye
polarizability: 626.7317214|47.2523805|452.0048824|-14.4697835|-45.5752505|253.8741832 unknown
InChI: InChI=1S/C21H20N4O4S2/c1-30(26,27)24-15-9-7-14(8-10-15)22-21-17-5-3-4-6-19(17)23-20-13-16(11-12-18(20)21)25-31(2,28)29/h3-13,22,24-25H,1-2H3
charge 0 multiplicity 1
51 atoms
S  5.228053 3.948385 -0.312126
S  -6.512675 1.00011 1.096288
O  6.791085 4.362995 -0.202874
O  4.19788 4.692551 -1.315964
O  -8.137131 1.03673 1.037534
O  -5.700935 0.919578 2.500361
N  -0.487006 -0.868579 -1.468829
N  3.052047 -1.90527 0.762852
N  5.280769 2.109923 -0.805047
N  -5.959695 -0.622307 0.036394
C  0.64569 -1.217517 -0.68877
C  1.772838 -0.338294 -0.689425
C  0.726431 -2.455642 0.030687
C  2.973381 -0.749707 0.031042
C  1.955414 -2.729669 0.773398
C  1.781058 0.941664 -1.3501
C  4.120941 0.110664 0.024689
C  4.114953 1.316834 -0.688606
C  -1.839845 -0.809458 -1.072481
C  2.913534 1.743845 -1.372456
C  -0.30215 -3.459866 0.012421
C  2.054573 -3.951341 1.528264
C  -0.16026 -4.640559 0.737782
C  -2.834342 -0.605154 -2.073447
C  -2.244611 -0.90663 0.291967
C  1.020873 -4.882145 1.518576
C  -4.60181 -0.635889 -0.362952
C  -4.188033 -0.487296 -1.721161
C  -3.602035 -0.838046 0.636218
C  4.441521 4.013527 1.444697
C  -5.841418 2.564786 0.17939
H  -0.283028 -0.470774 -2.388519
H  0.871883 1.304961 -1.841802
H  4.998449 -0.226763 0.587076
H  2.923304 2.69968 -1.90514
H  -1.204017 -3.29681 -0.583255
H  2.98021 -4.114436 2.088232
H  6.155272 1.729421 -0.40964
H  -0.953074 -5.39555 0.709554
H  -2.537368 -0.537104 -3.12729
H  -1.495326 -1.041904 1.076832
H  1.10896 -5.810787 2.092649
H  -4.938648 -0.315004 -2.503064
H  -3.918829 -0.934422 1.678938
H  -6.635096 -0.603145 -0.75285
H  4.328314 5.084107 1.664953
H  3.475473 3.495061 1.374879
H  5.150484 3.516983 2.120835
H  -6.414088 2.65275 -0.753852
H  -6.033435 3.398238 0.869278
H  -4.768033 2.397475 0.015965
