program: Gaussian 09
title: 000149372
version: EM64L-G09RevD.01
frameworkgroup: C1[X(C13H14OS)]
method: RPBEPBE
basis: SDD
operation: Freq
keyword: #p
keyword: freq=noraman
keyword: PBEPBE/SDD
title: #p freq=noraman PBEPBE/SDD
converged: YES YES NO NO
title: Mulliken charges:
elementType: S O C C C C C C C C C C C C C H H H H H H H H H H H H H H
charge: 0.628650 -0.620403 -0.202708 -0.206957 -0.458615 -0.510523 -0.455482 -0.227038 -0.215979 -0.119343 -0.255840 -0.263429 -0.215600 -0.217447 -0.226354 0.258977 0.245438 0.335020 0.255134 0.222456 0.246090 0.262534 0.245082 0.244055 0.310856 0.241014 0.235642 0.232970 0.231800
chargesum: 0.00000
title: Mulliken charges with hydrogens summed into heavy atoms:
elementType: S O C C C C C C C C C C C C C
charge: 0.628650 -0.620403 0.056269 0.038481 -0.123596 -0.032933 0.053142 0.018044 0.028076 -0.119343 0.055016 -0.022415 0.020043 0.015523 0.005446
polarizability: 2.02526782e+02 1.06810565e+01 1.49809686e+02 -1.03445325e+01 1.00455110e+01 1.09199902e+02
1716.lowfreq: -11.5973 -6.4285 0.0001 0.0022 0.0027 11.0386 22.3671 51.2294 68.2208
frequency: 19.8732 51.0516 68.1601 103.0569 148.3445 170.7401 210.9766 239.4937 289.2299 335.4191 376.3633 405.9039 421.0010 455.4829 471.7899 495.6638 606.5467 631.1511 652.9354 664.3577 703.0605 727.6668 756.1859 763.4565 786.4576 804.0640 829.5469 859.8347 867.0607 905.3458 921.5944 933.9606 941.9865 942.2155 950.4407 967.5483 980.1055 986.4074 1000.5539 1007.0600 1010.1627 1043.3266 1056.4953 1072.3325 1084.8065 1097.7124 1125.5476 1141.6445 1168.7060 1169.2269 1174.2132 1203.5174 1231.4351 1256.0147 1259.6441 1269.7338 1293.3550 1297.1386 1325.7782 1382.3952 1429.5552 1452.5418 1461.5642 1474.4361 1582.3515 1582.5276 1598.0201 3010.4895 3023.1907 3063.7431 3084.0674 3090.2085 3091.6539 3100.6801 3111.1693 3124.7615 3134.7159 3148.1617 3157.5103 3164.3046 3190.3381
redmass: 4.2009 4.2726 4.2797 4.4614 5.3259 5.7012 5.0374 6.0073 4.7172 6.1071 2.5736 2.9973 7.0151 2.6401 2.1654 3.5208 6.4764 3.0676 6.4484 4.3267 2.3755 1.6184 1.4734 5.1081 14.4881 3.7419 2.1530 1.2849 2.4226 2.6062 1.4572 1.3825 1.8067 2.9832 1.9302 1.9401 5.8341 1.3628 1.6633 1.3927 3.4836 2.0755 2.1377 1.5738 1.1472 1.0945 1.1383 1.3673 1.2166 1.3835 1.1190 1.2122 1.5507 1.3209 1.3480 1.6359 1.4895 1.3209 1.7455 9.2632 2.1631 2.0514 1.0880 1.0947 5.8474 5.7837 6.7170 1.0600 1.0611 1.0886 1.1016 1.0911 1.1049 1.0925 1.0894 1.0861 1.0901 1.0955 1.0875 1.1011 1.1096
irintensity: 0.6573 0.5627 0.1754 1.7511 2.6514 10.1295 4.2622 3.1720 1.5883 6.9097 1.7415 1.3577 12.5210 4.8367 3.9793 12.7854 0.0505 7.0062 1.3414 0.1657 31.1295 72.8495 59.9482 7.8360 47.4293 0.9171 10.1410 0.5544 4.5321 0.9325 4.7327 3.8627 4.3041 1.2886 2.9891 0.7903 1.7498 0.7251 4.0217 1.6579 7.0650 10.2559 3.1816 8.8214 3.9939 6.4466 5.4312 2.0414 6.8984 2.4746 2.1942 10.8607 8.4913 0.1853 1.1005 13.4566 0.3835 3.7610 15.7468 1.8335 12.8989 21.8790 12.8890 7.6210 8.7075 3.3636 2.7799 40.7811 15.4098 2.6640 5.4798 56.3161 40.6868 14.3799 8.9354 2.4000 1.1718 28.4421 6.7036 35.7483 13.5490
temp: 298.150 k
press: 1.00000 atm
elementType: 16 8 6 6 6 6 6 6 6 6 6 6 6 6 6 1 1 1 1 1 1 1 1 1 1 1 1 1 1
symmnumber: 1
zpe: 611239.5 jmol-1
zpe.correction: 0.232809 hartree
zpe.thermalcorrener: 0.245880 hartree
zpe.thermalcorrenthalpy: 0.246824 hartree
zpe.thermalcorrgfe: 0.191745 hartree
zpe.sumelectzpe: -975.858526 hartree
zpe.sumelectthermal: -975.845455 hartree
zpe.sumelectthermalent: -975.844511 hartree
zpe.sumelectthermalfe: -975.899590 hartree
dipole: 0.4666 -4.3439 1.1268
dipole: 4.5119
quadrupole: -82.3638 -105.2558 -93.9286
quadrupole: 5.0687 -2.0115 4.4053
quadrupole: 11.4856 -11.4064 -0.0792 5.0687 -2.0115 4.4053
hfenergy: -976.0913349 hartree
pointgroup: C01 [X(C13H14O1S1)]
dipole: 0.1663373 1.6764124 -0.5594359 debye
polarizability: 202.6119546|-9.3365156|150.7602177|11.6272494|7.2181494|108.1641982 unknown
InChI: InChI=1S/C13H14OS/c14-15(12-4-2-1-3-5-12)13-9-10-6-7-11(13)8-10/h1-7,10-11,13H,8-9H2
charge 0 multiplicity 1
29 atoms
S  0.008428 -1.049058 0.947843
O  -0.190684 -2.665284 0.53602
C  1.571904 1.122444 -0.328864
C  3.546854 -0.017895 -0.474955
C  1.12895 -0.372868 -0.512895
C  2.822701 1.114439 -1.273225
C  2.469665 -1.168254 -0.575425
C  2.267603 1.224942 1.039511
C  3.447513 0.544337 0.948457
C  -1.620537 -0.240011 0.359735
C  -2.511564 -1.090701 -0.314724
C  -1.922777 1.104517 0.647831
C  -3.75103 -0.562987 -0.744936
C  -3.167233 1.621389 0.212931
C  -4.076089 0.790035 -0.484433
H  0.784177 1.858788 -0.543419
H  4.551555 -0.311613 -0.812155
H  0.490656 -0.529591 -1.397837
H  3.364975 2.074485 -1.252082
H  2.586598 0.834426 -2.31641
H  2.549505 -1.709091 -1.534196
H  2.564384 -1.915174 0.230698
H  1.831474 1.681131 1.931993
H  4.155085 0.334726 1.754907
H  -2.216489 -2.137604 -0.469137
H  -1.222889 1.738307 1.205053
H  -4.463117 -1.205951 -1.274004
H  -3.426605 2.664631 0.424664
H  -5.040015 1.193486 -0.814345
