program: Gaussian 09
title: 000149417
version: EM64L-G09RevD.01
frameworkgroup: C1[X(C16H17N3O2)]
method: RPBEPBE
basis: SDD
operation: Freq
keyword: #p
keyword: freq=noraman
keyword: PBEPBE/SDD
title: #p freq=noraman PBEPBE/SDD
converged: YES YES NO NO
title: Mulliken charges:
elementType: O O N N N C C C C C C C C C C C C C C C C H H H H H H H H H H H H H H H H H
charge: -0.236094 -0.199064 -0.109983 -0.112640 -0.127535 0.474769 -0.340679 -0.363724 0.146076 -0.334027 -0.296768 0.443939 0.166152 -0.399972 -0.331154 -0.655808 -0.343149 -0.299975 -0.807787 0.293454 -0.752790 0.249386 0.234203 0.247572 0.273247 0.230845 0.227383 0.248010 0.257011 0.241453 0.246159 0.271154 0.232746 0.231110 0.224681 0.253010 0.259025 0.259762
chargesum: 0.00000
title: Mulliken charges with hydrogens summed into heavy atoms:
elementType: O O N N N C C C C C C C C C C C C C C C C
charge: -0.236094 -0.199064 -0.109983 -0.112640 -0.127535 0.474769 -0.091293 -0.129521 0.146076 -0.086455 -0.023521 0.443939 0.166152 -0.169127 -0.103771 0.090666 -0.096990 -0.028821 -0.119250 0.293454 0.019007
polarizability: 5.39992353e+02 9.51848029e+00 1.88659281e+02 -1.78752326e+01 1.68512176e+01 1.13015685e+02
1716.lowfreq: -5.0005 -2.5333 0.0004 0.0006 0.0011 6.0838 22.4481 26.5424 42.1157
frequency: 22.4390 26.3208 42.0807 45.0419 49.1978 59.1782 65.4657 80.5013 87.6957 137.1383 157.8587 180.1718 199.1599 201.2265 223.6350 273.3674 291.8039 322.9119 339.6665 351.5411 372.4848 389.3936 414.1052 425.0862 462.5965 480.0713 505.5388 522.7109 546.1766 555.7566 589.0221 620.5210 628.5027 639.0070 718.7709 721.2108 736.8489 743.8553 767.2960 816.2897 825.3696 835.7068 844.2890 850.2186 889.8680 899.7659 967.4692 970.1549 979.5604 980.7366 984.8301 989.5158 991.2844 1003.3307 1036.6109 1045.4295 1077.2172 1099.3403 1109.7120 1113.8400 1133.6296 1142.3899 1159.5196 1172.3240 1195.5371 1220.2678 1248.1134 1295.6674 1299.4345 1331.9880 1344.1981 1370.3869 1378.3984 1382.7816 1397.3336 1417.5041 1427.4638 1444.7160 1451.4327 1455.4711 1467.0556 1469.3220 1473.7513 1478.7601 1485.8257 1495.2474 1559.0455 1575.7529 1612.8705 1614.0611 1697.7388 2972.0291 2974.4305 3007.2945 3050.8315 3069.8267 3085.5396 3100.1241 3111.5814 3116.7103 3127.4673 3138.8078 3149.3681 3150.2803 3157.7541 3164.1781 3169.7263 3178.2826
redmass: 5.3434 3.6856 1.4173 2.2912 3.5669 1.4663 4.8182 2.5735 3.4289 3.2296 4.6695 5.0057 2.9280 5.0906 1.8941 2.4753 5.6026 3.6171 4.0955 3.5155 4.6252 4.5707 3.0421 3.4388 4.2035 4.7344 2.7889 5.5328 2.7398 3.8829 4.3465 5.9586 6.4772 6.6172 4.7965 3.3350 4.2364 5.2066 5.1044 1.3434 5.3374 1.5001 1.5249 1.3123 4.6975 7.3203 1.3489 1.3672 2.3618 1.3555 1.4309 1.3506 2.6731 2.6250 1.6159 1.5617 3.6007 1.5135 1.3420 1.2868 2.0289 2.0083 1.2679 1.9445 1.5968 2.7535 3.1887 1.3267 1.3568 3.8469 6.3927 4.8434 5.6141 1.2157 1.2622 3.7829 1.2273 3.6466 1.0545 1.0502 1.0684 1.0475 1.1408 1.2986 2.0475 2.3235 7.4363 6.1741 6.3982 6.4327 11.0203 1.0376 1.0375 1.0372 1.0971 1.0983 1.0985 1.0956 1.0989 1.0896 1.0885 1.1019 1.0878 1.0878 1.0955 1.0942 1.0959 1.0957
irintensity: 1.3393 0.2922 0.8769 0.8197 2.0586 1.4475 2.3200 2.0769 1.3035 10.2906 1.5103 3.4967 2.6814 2.0374 1.3317 11.2207 45.4941 21.6186 16.5533 15.6360 28.3624 30.6080 2.4889 0.9779 6.6643 2.4912 6.2469 19.7749 45.6400 9.5027 7.2353 1.6526 0.6205 2.9417 5.3484 3.7032 49.1407 114.0101 3.9521 2.5596 1.2955 1.4476 96.8862 21.1205 14.6286 0.3913 0.6487 4.1958 30.4191 1.6504 10.4497 1.2114 1.1860 10.5707 8.9800 13.8696 25.7328 251.2287 1.1056 25.0600 149.7046 22.9636 137.9706 22.6335 1.4345 2.9060 32.8908 0.1408 1.9796 234.0806 10.4322 5.8259 6.6325 51.1518 7.4551 3.6395 5.7085 4.8322 17.1272 18.9382 80.6512 12.8815 11.6402 1.8901 2.2073 130.2077 36.0387 1.2620 1.3916 417.8300 137.5400 72.6050 47.8856 0.9256 20.8326 17.8012 22.3469 6.6992 12.2253 28.8116 31.1820 4.5391 10.1841 0.3738 17.3837 7.7964 13.7486 12.2557
temp: 298.150 k
press: 1.00000 atm
elementType: 8 8 7 7 7 6 6 6 6 6 6 6 6 6 6 6 6 6 6 6 6 1 1 1 1 1 1 1 1 1 1 1 1 1 1 1 1 1
symmnumber: 1
zpe: 778937.1 jmol-1
zpe.correction: 0.296681 hartree
zpe.thermalcorrener: 0.317364 hartree
zpe.thermalcorrenthalpy: 0.318308 hartree
zpe.thermalcorrgfe: 0.244191 hartree
zpe.sumelectzpe: -933.013378 hartree
zpe.sumelectthermal: -932.992696 hartree
zpe.sumelectthermalent: -932.991751 hartree
zpe.sumelectthermalfe: -933.065869 hartree
dipole: 2.9678 -0.4530 -0.3264
dipole: 3.0199
quadrupole: -76.8370 -105.4911 -133.3546
quadrupole: -1.3103 -2.6684 2.6752
quadrupole: 28.3906 -0.2635 -28.1271 -1.3103 -2.6684 2.6752
hfenergy: -933.3100599 hartree
pointgroup: C01 [X(C16H17N3O2)]
dipole: -1.1642183 0.0118554 0.2367318 debye
polarizability: 540.6956552|-9.4816184|112.6887734|-4.7645585|-17.5867335|188.28289 unknown
InChI: InChI=1S/C16H17N3O2/c1-12-4-6-14(7-5-12)17-18-15-8-10-16(11-9-15)19(3)21-13(2)20/h4-11H,1-3H3
charge 0 multiplicity 1
38 atoms
O  -5.189531 0.283765 0.621473
O  -4.966094 -1.86546 -0.343487
N  -4.334307 0.814528 -0.446912
N  1.241487 0.184551 0.397759
N  2.044198 0.284239 -0.63784
C  -2.955475 0.597805 -0.266027
C  -2.414685 0.379222 1.036012
C  -2.066914 0.67996 -1.385047
C  -0.140886 0.333692 0.096989
C  -1.029428 0.245358 1.203774
C  -0.6847 0.554333 -1.202172
C  6.251426 -0.138327 0.049018
C  3.432291 0.131609 -0.326924
C  5.710348 0.094518 -1.241175
C  5.350528 -0.234656 1.149346
C  -5.000098 0.86132 -1.754207
C  4.319223 0.229105 -1.43016
C  3.963405 -0.10353 0.975094
C  7.747493 -0.277799 0.263112
C  -5.40996 -1.147861 0.56474
C  -6.236985 -1.552489 1.76132
H  -3.084117 0.332626 1.89861
H  -2.464472 0.826138 -2.393559
H  -0.598674 0.077354 2.196476
H  0.002788 0.609731 -2.051881
H  6.384748 0.17081 -2.102222
H  5.755237 -0.415548 2.153445
H  -6.063296 1.095007 -1.586575
H  -4.913382 -0.088398 -2.316995
H  -4.564473 1.688288 -2.341206
H  3.892249 0.409259 -2.422514
H  3.26942 -0.177763 1.817966
H  8.135957 0.528251 0.914727
H  7.995946 -1.237132 0.755067
H  8.299735 -0.233907 -0.691083
H  -7.008035 -2.275396 1.449224
H  -5.582167 -2.056508 2.495268
H  -6.702102 -0.679496 2.242167
