program: Gaussian 09
title: 000149376
version: EM64L-G09RevD.01
frameworkgroup: C1[X(C12H16N2O4S)]
method: RPBEPBE
basis: SDD
operation: Freq
keyword: #p
keyword: freq=noraman
keyword: PBEPBE/SDD
title: #p freq=noraman PBEPBE/SDD
converged: YES YES NO NO
title: Mulliken charges:
elementType: S O O O O N N C C C C C C C C C C C C H H H H H H H H H H H H H H H H
charge: 0.985881 -0.419143 -0.286485 -0.501761 -0.505425 -0.129529 0.035266 -0.024017 -0.452174 -0.450959 -0.383085 -0.290494 -0.035833 -0.241052 -0.238056 0.451481 -0.360233 -0.355747 -0.796083 0.265372 0.248449 0.231985 0.235654 0.232332 0.249272 0.265999 0.269919 0.224254 0.283610 0.284977 0.247212 0.247819 0.232446 0.231421 0.246726
chargesum: 0.00000
title: Mulliken charges with hydrogens summed into heavy atoms:
elementType: S O O O O N N C C C C C C C C C C C C
charge: 0.985881 -0.419143 -0.286485 -0.501761 -0.505425 -0.129529 0.035266 0.241355 0.028260 0.017027 0.132186 0.203679 -0.035833 0.042559 0.046921 0.451481 -0.113021 -0.107928 -0.085490
polarizability: 2.60439396e+02 3.04596601e+01 1.61899367e+02 -8.59666692e+00 1.58789730e+01 1.51202216e+02
1716.lowfreq: -18.4651 -0.0018 -0.0017 0.0006 0.9501 5.8602 11.3543 15.2665 16.4264
frequency: -17.8541 11.6948 16.1450 27.2125 35.4193 53.1156 69.5221 83.7936 118.4712 129.4003 148.3492 182.8376 206.2479 219.1990 232.5283 243.5832 295.0317 312.0875 322.1864 368.0643 384.1314 385.0690 407.4225 427.5361 473.5589 493.6896 505.5660 545.7941 584.5505 596.7943 621.4993 703.6876 726.6521 779.2881 784.0763 826.6231 836.0226 845.8759 848.9251 866.3662 893.8300 934.7203 944.6297 958.7776 964.5092 984.1513 985.8258 992.3261 993.3754 1035.2343 1049.4490 1055.8890 1103.9324 1114.6472 1120.9614 1129.2671 1156.8297 1181.3030 1186.3700 1190.4892 1208.6734 1219.6187 1236.1867 1274.0230 1291.6680 1298.9976 1307.8823 1319.4083 1325.7234 1351.3672 1355.1696 1383.0354 1394.2588 1399.4114 1469.2011 1470.3172 1473.0756 1473.1527 1474.0992 1480.8066 1486.0887 1595.1089 1595.6511 2982.3778 2988.5082 3000.5005 3004.2730 3015.1807 3017.1165 3065.4701 3067.0240 3075.8088 3089.1992 3094.8406 3104.5022 3140.2694 3141.6542 3165.4828 3168.3788
redmass: 1.0635 4.7593 5.7171 5.6197 4.5065 2.9889 4.7430 4.8400 4.7156 7.2599 6.6810 2.4507 3.2195 5.1042 7.1928 7.7913 5.2512 4.4195 5.4897 5.5229 7.1190 4.4055 2.8674 4.3707 4.1781 3.4138 4.5297 4.6871 2.7359 6.4600 6.9571 3.3350 4.4993 4.9047 3.0233 1.5614 5.6808 1.9752 1.2454 1.6040 2.5255 5.1829 2.3623 9.7859 1.2996 1.3772 1.3309 1.5077 4.6937 2.1496 1.5999 2.4887 2.3492 2.1633 1.2844 1.5792 1.9565 2.9381 1.1385 1.6005 1.6905 3.0466 1.4054 1.4375 1.4266 1.2610 1.3717 1.5126 1.8735 1.4472 1.8139 5.9643 3.0346 1.2179 1.0832 1.1037 1.1908 1.0812 1.8919 1.0838 1.0899 6.0460 6.9352 1.0390 1.0603 1.0634 1.0803 1.0691 1.0623 1.0948 1.0986 1.1069 1.1013 1.1002 1.1021 1.0892 1.0894 1.0958 1.0971
irintensity: 0.8896 0.5524 1.9247 0.2035 0.4108 1.6986 0.4538 3.7825 3.5888 2.1106 2.5797 1.1776 2.3386 20.4499 3.4818 3.5461 7.8871 6.0323 3.0793 1.0979 9.3926 2.0688 0.0113 46.2550 23.5204 9.1669 24.9483 125.6107 20.6865 75.7807 0.1805 0.8017 19.5209 3.0931 14.8268 96.1239 36.2042 4.8671 0.2494 0.7900 34.9869 118.9651 4.3692 70.6257 2.5010 1.3493 1.7137 4.1335 1.4286 7.8568 24.2803 27.6719 48.0694 9.5968 7.4092 29.2093 21.1188 20.5461 11.4054 39.9446 62.3605 7.1315 6.8076 28.1009 6.5615 2.6366 20.9654 24.3837 26.3643 10.9608 19.9463 0.3793 11.3990 17.6309 4.4929 17.9421 13.0042 11.5192 20.0299 21.4060 9.6411 16.1416 0.4664 20.5914 21.6647 22.4664 14.8563 12.9262 38.6512 16.8744 12.8931 10.5598 21.3988 14.0264 32.0364 12.4049 5.6868 0.2767 9.5502
temp: 298.150 k
press: 1.00000 atm
elementType: 16 8 8 8 8 7 7 6 6 6 6 6 6 6 6 6 6 6 6 1 1 1 1 1 1 1 1 1 1 1 1 1 1 1 1
symmnumber: 1
zpe: 703990.7 jmol-1
zpe.correction: 0.268136 hartree
zpe.thermalcorrener: 0.287360 hartree
zpe.thermalcorrenthalpy: 0.288305 hartree
zpe.thermalcorrgfe: 0.216054 hartree
zpe.sumelectzpe: -1273.657830 hartree
zpe.sumelectthermal: -1273.638606 hartree
zpe.sumelectthermalent: -1273.637662 hartree
zpe.sumelectthermalfe: -1273.709913 hartree
dipole: 6.2249 7.5917 -0.1674
dipole: 9.8189
quadrupole: -112.8885 -125.9690 -119.9633
quadrupole: -8.9473 -14.8129 2.9340
quadrupole: 6.7184 -6.3621 -0.3563 -8.9473 -14.8129 2.9340
hfenergy: -1273.9259663 hartree
pointgroup: C01 [X(C12H16N2O4S1)]
dipole: -2.5111907 -2.9354634 0.0137058 debye
polarizability: 261.9735553|28.0709611|160.4181353|5.5528311|-16.7632068|151.1492891 unknown
InChI: InChI=1S/C12H16N2O4S/c1-10-4-6-12(7-5-10)19(16,17)18-9-11-3-2-8-14(11)13-15/h4-7,11H,2-3,8-9H2,1H3
charge 0 multiplicity 1
35 atoms
S  -0.858561 1.48263 0.619347
O  0.323655 0.20316 -0.082102
O  5.780741 0.897803 -1.050315
O  -0.750963 2.827151 -0.277436
O  -0.623541 1.542284 2.221299
N  3.997292 -0.306297 -0.473275
N  4.492347 0.791624 -1.116898
C  2.532926 -0.587063 -0.492093
C  2.415603 -1.792469 0.475508
C  3.790772 -2.508641 0.368875
C  4.810887 -1.357812 0.197989
C  1.732797 0.658159 -0.061143
C  -2.431081 0.55296 0.223835
C  -2.936354 -0.331921 1.188984
C  -3.047484 0.795107 -1.013823
C  -4.8030 -0.809094 -0.353301
C  -4.134722 -1.012844 0.883732
C  -4.24462 0.100744 -1.291067
C  -6.106394 -1.524535 -0.654227
H  2.2232 -0.870206 -1.516451
H  1.567296 -2.442662 0.212077
H  2.249287 -1.422374 1.504212
H  4.01098 -3.127177 1.254393
H  3.813845 -3.1661 -0.519115
H  5.195363 -0.974681 1.162532
H  5.684129 -1.603905 -0.430319
H  1.88423 1.492117 -0.768735
H  2.029953 0.967094 0.960433
H  -2.42103 -0.47039 2.144536
H  -2.61555 1.50694 -1.724157
H  -4.554888 -1.710994 1.61631
H  -4.749892 0.267472 -2.248965
H  -6.230263 -1.705638 -1.735795
H  -6.167237 -2.495166 -0.132878
H  -6.970823 -0.917777 -0.321866
