program: Gaussian 09
title: 000149371
version: EM64L-G09RevD.01
frameworkgroup: C1[X(C10H9NO5S)]
method: RPBEPBE
basis: SDD
operation: Freq
keyword: #p
keyword: freq=noraman
keyword: PBEPBE/SDD
title: #p freq=noraman PBEPBE/SDD
converged: YES YES NO NO
title: Mulliken charges:
elementType: S O O O O O N C C C C C C C C C C H H H H H H H H H
charge: 1.040857 -0.251639 -0.575956 -0.490399 -0.513376 -0.194529 -0.684934 0.507667 0.242544 -0.808427 0.223913 -0.454187 -0.356154 -0.573388 0.567949 -0.480591 0.126085 0.308752 0.320213 0.257899 0.267410 0.262945 0.231386 0.322475 0.320593 0.382891
chargesum: 0.00000
title: Mulliken charges with hydrogens summed into heavy atoms:
elementType: S O O O O O N C C C C C C C C C C
charge: 1.040857 -0.251639 -0.193065 -0.490399 -0.513376 -0.194529 -0.041866 0.507667 0.242544 -0.179462 0.223913 -0.196288 -0.088744 -0.310443 0.567949 -0.249205 0.126085
polarizability: 2.26858328e+02 -2.96882403e+01 2.26614276e+02 1.41419061e+01 3.11340985e+00 9.13102897e+01
1716.lowfreq: -6.0276 -1.3934 -0.0010 0.0011 0.0011 4.3591 15.8294 47.5442 53.0187
frequency: 15.7774 47.5167 53.0043 94.6783 108.5105 148.8095 164.0906 181.8169 201.4476 239.8423 242.6693 270.9604 292.1042 310.2393 313.1035 354.0659 374.4617 418.2610 420.3204 441.9572 455.4327 464.6498 469.7548 512.9331 537.4558 558.0724 621.5637 650.2061 663.7047 681.8418 705.9066 749.9734 771.9773 793.9218 813.4003 840.0947 864.4403 865.4801 897.0061 943.2583 956.6153 976.6770 1029.2443 1039.9255 1068.8371 1091.2645 1136.9648 1160.9079 1193.2090 1232.6967 1243.9656 1272.1732 1346.9722 1392.3330 1418.7443 1432.3361 1462.0506 1530.4347 1540.0108 1587.2295 1636.2144 1648.8117 1681.8647 3074.2797 3134.6814 3154.9612 3162.3545 3165.7811 3177.3157 3500.1949 3557.8222 3697.1529
redmass: 11.1011 7.1291 6.4947 7.1495 5.8605 5.1315 5.7452 3.7506 2.1058 4.2697 5.3799 4.7751 4.5487 3.1730 8.0344 6.9422 4.2658 6.1218 1.0848 2.3840 4.1919 1.5756 6.0511 6.4708 8.1081 5.9834 5.4281 5.2958 3.2612 5.3745 4.9311 3.1249 6.6987 6.3864 1.6353 7.2964 1.6754 1.7231 2.1146 1.3682 3.0639 4.3505 1.4190 1.5263 2.5471 3.0020 1.3009 2.1067 1.8399 1.1527 1.4551 1.5958 2.0461 3.9252 3.0100 1.2809 5.3808 3.7168 7.3851 7.9419 5.0401 1.2741 9.3956 1.0579 1.0876 1.0972 1.0932 1.1104 1.0924 1.0665 1.0454 1.1041
irintensity: 1.7442 1.3889 2.2259 0.3620 3.8152 10.8598 4.1697 25.3235 34.5227 10.4630 5.1970 5.0196 53.7416 5.2212 11.8088 36.2980 1.6787 0.6133 8.0033 127.5306 23.6912 178.4467 19.7290 58.8924 146.9933 2.4169 6.1703 2.5065 5.3044 1.1706 0.7217 0.7770 3.1201 28.8124 38.5141 28.6040 0.5930 91.9830 16.1359 0.5469 33.4921 40.7867 59.6111 10.1605 15.6217 37.7819 14.9569 50.0976 6.9100 4.3501 6.2163 40.8232 32.8892 21.7205 101.4705 61.3181 4.5478 35.1061 82.3091 14.5771 662.7089 415.7493 292.1317 2.1045 4.7484 7.5672 4.8986 0.0354 0.6930 71.1996 163.8259 28.2622
temp: 298.150 k
press: 1.00000 atm
elementType: 16 8 8 8 8 8 7 6 6 6 6 6 6 6 6 6 6 1 1 1 1 1 1 1 1 1
symmnumber: 1
zpe: 468091.2 jmol-1
zpe.correction: 0.178287 hartree
zpe.thermalcorrener: 0.194796 hartree
zpe.thermalcorrenthalpy: 0.195740 hartree
zpe.thermalcorrgfe: 0.133188 hartree
zpe.sumelectzpe: -1214.004883 hartree
zpe.sumelectthermal: -1213.988374 hartree
zpe.sumelectthermalent: -1213.987430 hartree
zpe.sumelectthermalfe: -1214.049982 hartree
dipole: 2.4647 -5.8489 -2.8927
dipole: 6.9751
quadrupole: -76.8759 -118.9057 -111.5262
quadrupole: -21.5622 7.3012 -2.8178
quadrupole: 25.5600 -16.4698 -9.0902 -21.5622 7.3012 -2.8178
hfenergy: -1214.1831698 hartree
pointgroup: C01 [X(C10H9N1O5S1)]
dipole: 1.3799687 -2.1586884 -0.9831101 debye
dipolederiv: 1.760448 0.1816699 0.0984635 0.1153437 1.1199147 0.0489945 -0.0517555 -0.0079413 1.2575256 -0.6270335 0.4465206 -0.0143322 0.2971779 -0.8823644 -0.0042064 -0.0721904 0.0384 -0.2070738 -1.2544882 -0.1481801 -0.2351321 -0.1268684 -0.4915404 -0.1620722 -0.2118504 -0.1502288 -0.459154 -0.5358653 -0.020077 0.0619661 -0.0773166 -0.4544221 -0.085959 0.1985344 0.0417721 -0.6212812 -0.6006513 -0.0484982 -0.0034421 -0.062095 -0.7096509 0.0674671 0.1687055 0.0688732 -0.4862081 -0.3987599 -0.1126217 -0.0028604 0.2805938 -1.5763783 -0.0315485 0.0351876 -0.1682522 -0.3365592 -1.6336671 0.740869 -0.1129672 0.5760954 -0.4077805 0.1644352 -0.176958 0.2250324 -0.7102099 0.7171264 -0.483251 0.0476346 -0.7115297 0.561743 -0.0615818 0.19046 -0.0101003 -0.0823256 -0.8626951 0.4575092 -0.1230508 0.0821208 -0.5158856 -0.006705 -0.2198026 0.0915891 -0.0812296 0.2910969 0.1927312 -0.0263233 0.2882195 0.2603804 -0.062262 -0.1323563 -0.094017 0.033174 0.8341842 -0.3433563 0.1017402 -0.0970249 0.5731953 0.0215432 0.1774388 -0.0507671 0.1933535 -0.192601 -0.4987983 0.0246849 0.4993165 -0.8577233 0.0584802 0.0126237 -0.2236202 -0.1131257 0.3538077 -0.2899471 0.0612308 -0.3448953 0.4445249 -0.0208476 0.0460652 -0.0547601 -0.0799196 -0.4465963 0.2579492 -0.0004002 0.611802 -0.4214092 0.1261802 0.0184362 0.0563942 -0.2398255 1.6721642 -0.7902741 0.2753505 -0.5139469 0.392904 -0.1055909 0.3670005 -0.1957627 0.2325658 -0.7466106 0.4353301 -0.0537075 -0.2434183 0.1332459 -0.0220133 -0.1612919 0.1355156 -0.235263 0.7023062 0.2520941 0.0421248 -0.4558093 2.1257185 0.0542625 -0.0035277 0.2633915 0.305586 0.0528028 0.0077001 0.0475809 -0.0828231 -0.0180018 -0.020379 0.0729881 0.009427 0.0484656 0.0079792 -0.0309089 0.0051828 0.0472565 0.0366837 0.0435951 0.0446751 0.036058 0.080149 -0.0080123 0.0050909 -0.0406665 0.0272711 0.0892005 -0.0113365 -0.0248522 -0.0010885 0.1338901 0.0607308 -0.0766082 -0.0515296 -0.0430549 0.054811 -0.0145759 -0.0523992 -0.0023869 0.1203121 -0.0073578 -0.0350046 -0.0554668 -0.0465384 0.0509254 -0.0288034 -0.0599408 -0.0264434 0.1684936 0.0504065 0.059347 -0.0217772 0.0549463 -0.0889981 -0.0166258 -0.0300693 -0.0019634 0.1609151 0.2937606 -0.0459801 -0.0383482 0.0444487 0.0997207 -0.0217111 -0.0306597 -0.0395317 0.3685141 0.2291087 -0.0497985 -0.0515773 -0.118086 0.2062466 -0.0419448 -0.0633647 -0.02465 0.3624614 0.2884161 -0.0635073 0.0656222 -0.0011853 0.2749401 0.1332052 -0.0410964 0.0850608 0.1867694 unknown
polarizability: 235.7250785|-27.135369|216.8771354|19.4792193|-1.9542741|92.1806802 unknown
InChI: InChI=1S/C10H9NO5S/c11-7-1-2-8-6(5-17(13,14)15)3-10(12)16-9(8)4-7/h1-4,13H,5,11H2
charge 0 multiplicity 1
26 atoms
S  -2.843237 -1.249492 0.278335
O  1.420829 2.139416 0.112239
O  -4.450401 -1.272165 -0.679028
O  -3.018339 -0.383793 1.62684
O  -2.269074 -2.762462 0.368543
O  0.108938 4.036482 0.011055
N  4.318932 -1.688744 0.48863
C  -0.789799 0.549456 -0.697517
C  0.483333 -0.085103 -0.416204
C  -1.955349 -0.235139 -1.189201
C  1.572248 0.752695 -0.009591
C  -0.942684 1.922213 -0.544388
C  0.73697 -1.488397 -0.492718
C  2.843348 0.243572 0.288442
C  3.073584 -1.155339 0.197565
C  1.994607 -2.016157 -0.197245
C  0.145611 2.800044 -0.137375
H  -1.731969 -1.061572 -1.879295
H  -2.794844 0.377772 -1.544522
H  -1.898441 2.416933 -0.736525
H  -0.069817 -2.178655 -0.76102
H  3.632372 0.938054 0.592442
H  2.160913 -3.097525 -0.254249
H  5.089261 -1.09216 0.778624
H  4.480977 -2.69106 0.440891
H  -5.104869 -1.837575 -0.177028
