program: Gaussian 09
title: 000149405
version: EM64L-G09RevD.01
frameworkgroup: C1[X(C14H12N4O5)]
method: RPBEPBE
basis: SDD
operation: Freq
keyword: #p
keyword: freq=noraman
keyword: PBEPBE/SDD
title: #p freq=noraman PBEPBE/SDD
converged: YES YES NO NO
title: Mulliken charges:
elementType: O O O O O N N N N C C C C C C C C C C C C C C H H H H H H H H H H H H
charge: -0.256791 -0.197943 -0.196068 -0.205108 -0.203459 -0.120566 -0.082431 0.023113 0.021846 0.321225 0.334824 0.130103 0.396139 -0.468038 -0.337172 0.408178 -0.492651 -0.379175 -0.352407 -0.767224 0.409511 -0.376561 -0.810263 0.324393 0.252762 0.306339 0.293324 0.245857 0.270455 0.247067 0.221170 0.289414 0.231367 0.231729 0.287043
chargesum: 0.00000
title: Mulliken charges with hydrogens summed into heavy atoms:
elementType: O O O O O N N N N C C C C C C C C C C C C C C
charge: -0.256791 -0.197943 -0.196068 -0.205108 -0.203459 -0.120566 -0.082431 0.023113 0.021846 0.321225 0.334824 0.130103 0.396139 -0.143646 -0.084410 0.408178 -0.186311 -0.085851 -0.106550 -0.028532 0.409511 -0.087147 -0.060123
polarizability: 3.40385773e+02 -6.84311264e+00 1.86361324e+02 1.26038815e+01 1.03080186e+00 1.64401352e+02
1716.lowfreq: -5.7680 -3.9250 0.0005 0.0007 0.0008 3.2538 16.1625 33.3606 43.6848
frequency: 16.0443 33.3323 43.6793 57.4870 66.8343 77.0360 104.1804 114.2076 134.3765 148.7939 152.5399 164.4144 195.3134 217.7288 235.3679 275.6819 298.7709 311.4131 322.9436 344.3204 351.9239 376.7970 398.3114 414.4913 452.0172 460.8235 508.9003 526.4354 534.1476 550.8020 596.2108 619.2528 623.1232 645.4372 687.5190 702.5855 707.0511 711.0789 717.7821 746.8539 754.1478 760.6322 824.6637 841.0189 848.4862 874.3949 915.3021 938.1260 941.4052 983.8809 992.1691 998.3338 1005.1083 1042.5591 1043.3025 1055.9153 1077.0666 1108.6628 1137.4160 1146.8763 1184.0694 1202.7071 1207.1231 1220.7923 1224.7657 1238.5537 1267.1912 1269.8707 1347.0809 1364.2208 1370.5065 1387.1296 1392.9662 1397.3993 1404.9978 1406.5494 1413.1561 1453.2505 1454.5381 1466.6376 1471.0833 1475.5371 1482.2283 1572.6669 1591.1798 1606.9225 1610.3247 2973.6867 3000.9620 3051.0009 3086.9147 3095.6203 3103.0490 3145.2294 3152.4195 3186.6424 3187.4288 3188.7813 3194.5780
redmass: 6.8851 6.8783 10.0942 10.5264 8.9655 9.9992 4.1467 3.9711 1.8823 1.1369 3.8333 2.6567 3.3021 4.9097 7.3199 5.0116 4.4760 4.5462 4.8448 7.6844 6.1603 6.3524 4.9810 3.8765 3.1254 3.4335 5.9382 6.1646 5.5782 5.1225 6.5445 7.4226 7.1541 7.6871 7.1128 7.1367 4.7415 3.4598 4.4374 5.6542 7.3318 7.2769 6.8213 1.3497 1.3171 6.4205 4.2698 1.5931 1.5231 1.3458 1.3506 1.5285 1.5161 1.5848 1.5801 2.3770 1.9865 4.1546 1.6466 1.3076 2.6984 4.2238 3.8811 6.2722 8.8627 5.5604 1.4119 1.4143 6.7983 5.8044 8.4088 6.9227 3.6268 1.2818 1.9029 2.5525 4.0784 1.0984 1.1057 2.3706 1.2334 2.2988 1.2311 8.0549 8.3725 6.8122 7.0945 1.0379 1.0366 1.0955 1.0962 1.0990 1.1015 1.0905 1.0905 1.0925 1.0954 1.0949 1.0926
irintensity: 1.8894 1.8629 0.2024 0.8396 0.8041 1.4013 0.3965 0.7078 0.6819 2.1854 0.6275 1.3615 2.4021 4.6165 2.6549 3.2737 5.1429 2.0520 2.2851 2.7810 2.3963 1.7132 0.3835 1.2102 5.0928 5.5812 8.7664 1.6002 10.5290 0.2295 23.4274 15.3479 4.0543 8.8124 13.3886 22.8162 11.7987 7.7992 3.8808 4.2844 15.1056 15.4800 17.5283 19.0565 23.8704 5.1876 9.2306 15.4727 29.3399 2.0918 2.1337 1.3406 1.8922 9.8107 3.4980 11.3656 34.7363 17.8949 22.0145 29.6312 4.1107 204.6884 151.7784 192.9853 189.9273 26.4029 7.1274 7.4096 131.0200 12.7630 107.8323 8.5788 34.7041 20.9581 15.1917 27.0303 53.4315 25.7870 25.9910 16.3047 26.5601 17.6446 20.4191 7.1109 3.5847 24.7419 39.8941 7.5591 7.8906 6.9956 6.9591 19.8657 29.7251 11.9182 10.2863 2.9240 2.3118 5.7247 8.9740
temp: 298.150 k
press: 1.00000 atm
elementType: 8 8 8 8 8 7 7 7 7 6 6 6 6 6 6 6 6 6 6 6 6 6 6 1 1 1 1 1 1 1 1 1 1 1 1
symmnumber: 1
zpe: 650680.2 jmol-1
zpe.correction: 0.247831 hartree
zpe.thermalcorrener: 0.268383 hartree
zpe.thermalcorrenthalpy: 0.269327 hartree
zpe.thermalcorrgfe: 0.196394 hartree
zpe.sumelectzpe: -1133.942996 hartree
zpe.sumelectthermal: -1133.922444 hartree
zpe.sumelectthermalent: -1133.921500 hartree
zpe.sumelectthermalfe: -1133.994433 hartree
dipole: -2.9368 6.1298 1.7396
dipole: 7.0161
quadrupole: -158.5659 -142.8115 -128.0094
quadrupole: -10.6310 27.2482 -2.9664
quadrupole: -15.4370 0.3174 15.1196 -10.6310 27.2482 -2.9664
hfenergy: -1134.1908269 hartree
pointgroup: C01 [X(C14H12N4O5)]
dipole: -1.0401305 -0.3374567 -2.5345265 debye
polarizability: 334.2275056|34.3432803|172.3142107|6.1660665|7.7297557|184.6067329 unknown
InChI: InChI=1S/C14H12N4O5/c1-9-3-5-11(17(20)21)7-13(9)15-16(19)14-8-12(18(22)23)6-4-10(14)2/h3-8H,1-2H3
charge 0 multiplicity 1
35 atoms
O  0.097874 -0.446519 -1.736545
O  -5.680364 0.316644 2.307054
O  -3.815051 1.595895 2.613523
O  6.236384 0.274586 1.961692
O  4.603779 -0.999429 2.918911
N  -0.315439 -0.311543 -0.493838
N  0.38834 0.116666 0.542609
N  -4.452567 0.623478 2.054693
N  5.012514 -0.125732 2.060789
C  -1.713484 -0.674797 -0.190516
C  -2.337906 -1.758539 -0.875113
C  1.725895 0.573817 0.315111
C  2.10343 1.581504 -0.635858
C  -2.384164 0.100919 0.774379
C  -3.695119 -2.018725 -0.540702
C  -3.728793 -0.198014 1.051956
C  2.677323 0.044536 1.221505
C  -4.403586 -1.25333 0.402647
C  3.468803 1.969672 -0.675377
C  -1.641618 -2.641993 -1.887443
C  4.016869 0.455779 1.12802
C  4.437436 1.413093 0.178575
C  1.097462 2.271748 -1.524764
H  -1.873975 0.910374 1.300683
H  -4.200429 -2.851941 -1.039631
H  2.373673 -0.684993 1.976158
H  -5.449365 -1.457652 0.64582
H  3.769452 2.737874 -1.39601
H  -1.504685 -2.109824 -2.84459
H  -0.630085 -2.933515 -1.557595
H  -2.234398 -3.554034 -2.067975
H  5.487458 1.712979 0.139485
H  0.186021 2.554634 -0.965481
H  1.523065 3.184791 -1.971859
H  0.772851 1.591392 -2.335409
