program: Gaussian 09
title: 000149470
version: EM64L-G09RevD.01
frameworkgroup: C1[X(C22H24N4O6)]
method: RPBEPBE
basis: SDD
operation: Freq
keyword: #p
keyword: freq=noraman
keyword: PBEPBE/SDD
title: #p freq=noraman PBEPBE/SDD
converged: YES YES NO NO
title: Mulliken charges:
elementType: O O O O O O N N N N C C C C C C C C C C C C C C C C C C C C C C H H H H H H H H H H H H H H H H H H H H H H H H
charge: -0.493882 -0.493851 -0.395521 -0.395534 -0.277605 -0.277606 -0.388129 -0.388148 -0.364774 -0.364753 0.166319 0.166349 0.246834 0.246874 0.103383 0.103372 -0.003445 -0.003462 -0.362894 -0.362890 0.080393 0.080400 -0.353906 -0.353880 -0.331923 -0.331917 -0.450663 -0.450699 0.263002 0.263003 -0.765169 -0.765170 0.253716 0.253708 0.391666 0.391657 0.220265 0.270199 0.220245 0.270216 0.259997 0.259998 0.259194 0.236039 0.259208 0.236027 0.317251 0.317248 0.394018 0.394020 0.215213 0.254957 0.255441 0.215210 0.254966 0.255433
chargesum: 0.00000
title: Mulliken charges with hydrogens summed into heavy atoms:
elementType: O O O O O O N N N N C C C C C C C C C C C C C C C C C C C C C C
charge: -0.493882 -0.493851 -0.001503 -0.001514 -0.277605 -0.277606 0.003537 0.003508 -0.047523 -0.047505 0.166319 0.166349 0.246834 0.246874 0.103383 0.103372 -0.003445 -0.003462 -0.109178 -0.109182 0.080393 0.080400 0.136558 0.136581 -0.071925 -0.071919 0.044570 0.044536 0.263002 0.263003 -0.039557 -0.039561
polarizability: 3.92348109e+02 -4.37116034e-03 5.11712849e+02 2.24079132e+01 1.77363768e-02 1.76612485e+02
1716.lowfreq: -5.7677 -2.4916 -0.0007 0.0001 0.0004 3.9908 12.2150 12.3493 18.0038
frequency: 11.8437 12.1341 17.8624 18.4749 40.3822 45.4110 52.1865 57.0218 78.3938 85.0715 87.4669 93.0648 106.2183 109.4189 148.9568 156.9146 157.3867 182.7695 190.5687 204.7764 205.9305 209.5422 261.5757 279.0941 288.5006 288.6289 302.2435 321.8859 350.1366 361.0651 377.6088 399.1053 410.2447 422.9897 425.6965 442.9332 452.4571 460.9464 461.4249 482.6457 483.4243 502.7497 507.0624 513.3529 534.6103 536.1836 540.0512 586.7111 597.3469 597.3630 617.7481 618.6405 629.2261 644.6491 664.8751 701.2850 716.7467 730.6988 748.0196 783.3593 787.0077 791.5764 818.9034 828.9494 829.5534 835.6868 839.4602 849.5308 899.3961 904.4117 925.0605 926.5731 956.1211 956.7434 959.4084 975.7765 984.1216 986.1419 986.9903 988.9177 990.7430 1042.8992 1042.9501 1081.6944 1086.8665 1090.9533 1117.1760 1117.2212 1132.4794 1133.7737 1164.9633 1176.9551 1222.9816 1223.1838 1245.8932 1248.1545 1258.6239 1259.6234 1281.3525 1288.7146 1290.6978 1292.6578 1294.8593 1332.4669 1334.8327 1352.4716 1354.9277 1365.9616 1365.9799 1373.7303 1374.9479 1389.6877 1389.7108 1414.7486 1432.7382 1435.6709 1436.0577 1450.2209 1450.2593 1452.6529 1456.2127 1466.8748 1467.0672 1468.0946 1481.6390 1481.6474 1487.5687 1488.3659 1490.5657 1510.5344 1544.7779 1576.2977 1588.7263 1616.1663 1616.5628 1621.5030 1633.3143 1644.6531 2590.3763 2595.5504 2958.8934 2959.3999 2998.6844 2998.6877 3007.7797 3007.7931 3024.7477 3024.7837 3086.3466 3086.3633 3100.1159 3100.1239 3102.3458 3102.3535 3121.8410 3128.1725 3153.5834 3161.4858 3175.1614 3182.3264 3561.4892 3561.5031
redmass: 4.5592 5.2092 5.9821 6.1361 7.6348 6.5511 4.5548 4.5669 3.3807 1.1911 1.3660 4.6882 3.0782 3.3459 4.1214 5.1831 5.9281 5.2186 3.9847 5.2201 3.2693 7.3198 4.4957 4.1657 3.6359 5.9136 3.0525 2.7454 4.4945 5.8097 4.1807 3.2921 2.9404 6.3405 7.1601 8.8220 9.8923 6.7537 3.6269 11.6692 2.6088 5.9403 3.5137 3.6529 1.6747 1.5486 2.9392 3.2031 3.0965 3.0267 3.3551 4.5243 3.1727 3.6547 5.8238 7.2918 6.6061 6.1397 4.3172 8.4405 3.2020 3.1920 1.7817 2.4412 1.5581 1.6710 1.4475 2.1017 3.4256 2.9628 2.5008 2.3224 6.3798 1.3371 1.3668 2.8543 1.7385 1.2449 1.0882 1.6778 2.2830 1.6557 1.6565 2.3610 2.1085 1.9876 3.6450 3.5706 3.8222 2.1149 3.0548 1.4463 1.1202 1.1179 2.0662 1.6850 1.9574 2.0298 4.7874 4.5217 1.3044 1.4489 2.8699 1.8987 2.2108 2.0905 1.7276 4.8015 1.6671 1.2822 1.3084 1.2276 1.2270 6.7660 6.7139 1.1676 1.1827 1.0491 1.0456 2.2380 4.4922 1.1472 1.1004 2.8424 1.1922 1.0849 2.2039 1.8076 3.0777 2.2351 5.2409 2.5405 2.8833 5.3321 5.9544 2.4986 2.0941 5.9318 1.0730 1.0695 1.0590 1.0591 1.0360 1.0360 1.0880 1.0880 1.0736 1.0736 1.1049 1.1049 1.0979 1.0979 1.1010 1.1010 1.0826 1.0823 1.0863 1.0881 1.0967 1.0976 1.0789 1.0789
irintensity: 1.2977 0.3041 2.0967 0.2125 0.6611 26.1409 0.8957 15.0226 4.2077 0.0359 1.6893 0.1345 5.4521 0.0705 2.1545 0.0245 0.1462 0.8490 5.1423 7.3242 0.0314 2.4669 2.2894 16.8398 2.4880 6.2386 1.0735 0.2204 0.5689 0.0432 0.2605 6.4066 10.5933 0.0440 0.0087 2.2447 10.8150 12.4455 1.2766 22.6361 38.3002 0.0143 4.3540 70.4049 242.8230 8.5000 76.8125 2.3021 0.6169 11.0987 3.0906 24.9235 8.9068 15.9539 0.3416 2.4279 0.0476 14.0079 27.3299 0.1865 6.3535 10.4115 59.5148 0.3711 53.7874 76.4869 0.2190 47.0330 12.4021 7.8454 15.7656 0.1305 45.3831 0.0007 0.0133 14.5577 0.9801 0.8809 292.9427 0.1678 8.3711 41.6034 1.5487 3.7343 0.0643 1.2159 1.2792 17.3192 23.5409 30.7271 31.7945 2.4008 0.2690 0.6475 34.2785 347.8812 153.1652 0.1975 274.9091 60.1958 73.9801 8.3332 58.3205 40.5622 2.3519 153.9320 0.2291 392.9392 87.7498 5.4972 30.9427 99.8928 9.3890 16.3635 34.4201 87.6823 60.8015 52.1917 0.2149 219.6794 1.7060 59.1255 53.9490 201.3038 105.5296 14.8018 240.8557 19.0712 128.3831 23.4917 472.3898 112.3426 177.4303 385.8643 37.8483 22.1074 51.5184 131.9897 113.0096 75.1423 16.3970 119.3823 5.1353 8.8420 1.6005 3.2166 4.7641 99.4100 5.1494 11.7780 13.8289 3.9946 9.8909 25.5808 0.1059 32.7676 4.1444 1.4262 11.9231 10.7466 15.2764 11.5297
temp: 298.150 k
press: 1.00000 atm
elementType: 8 8 8 8 8 8 7 7 7 7 6 6 6 6 6 6 6 6 6 6 6 6 6 6 6 6 6 6 6 6 6 6 1 1 1 1 1 1 1 1 1 1 1 1 1 1 1 1 1 1 1 1 1 1 1 1
symmnumber: 1
zpe: 1145833.3 jmol-1
zpe.correction: 0.436425 hartree
zpe.thermalcorrener: 0.466512 hartree
zpe.thermalcorrenthalpy: 0.467456 hartree
zpe.thermalcorrgfe: 0.370778 hartree
zpe.sumelectzpe: -1520.876009 hartree
zpe.sumelectthermal: -1520.845922 hartree
zpe.sumelectthermalent: -1520.844978 hartree
zpe.sumelectthermalfe: -1520.941655 hartree
dipole: -0.0006 -0.4944 0.0012
dipole: 0.4944
quadrupole: -185.1247 -207.6594 -184.9483
quadrupole: 0.0032 14.3893 0.0013
quadrupole: 7.4528 -15.0819 7.6291 0.0032 14.3893 0.0013
hfenergy: -1521.3124337 hartree
pointgroup: C01 [X(C22H24N4O6)]
dipole: 0.0001948 0.1945143 0.0004462 debye
polarizability: 392.4095588|-0.0251608|511.7128375|-22.1100562|-0.0544677|176.5510475 unknown
InChI: InChI=1S/C22H24N4O6/c1-11(27)23-7-9-25-13-3-4-14(26-10-8-24-12(2)28)18-17(13)21(31)19-15(29)5-6-16(30)20(19)22(18)32/h3-6,23-26,29-30H,7-10H2,1-2H3
charge 0 multiplicity 1
56 atoms
O  2.698401 -1.205669 -0.691147
O  -2.698039 -1.206512 0.691232
O  2.713885 -3.704145 -0.691644
O  -2.712494 -3.705035 0.692796
O  6.251858 3.147889 0.861181
O  -6.253582 3.145446 -0.861119
N  2.717172 1.364693 -0.742922
N  -2.717588 1.364023 0.742803
N  5.6795 1.330307 -0.458191
N  -5.680018 1.328585 0.458722
C  0.701175 0.095978 -0.18539
C  -0.70128 0.095777 0.185183
C  1.396242 1.348611 -0.376672
C  -1.39672 1.348237 0.376319
C  0.695085 -2.419856 -0.176661
C  -0.694227 -2.420071 0.17727
C  1.402568 -1.163485 -0.361366
C  -1.40227 -1.163907 0.361237
C  0.668768 2.576977 -0.180613
C  -0.669643 2.576795 0.179983
C  1.382692 -3.663996 -0.351399
C  -1.381283 -3.664434 0.35266
C  3.538088 2.563391 -0.932807
C  -3.538872 2.56254 0.93225
C  0.679383 -4.890478 -0.171654
C  -0.677396 -4.890693 0.173633
C  4.94831 2.167034 -1.422869
C  -4.948842 2.165965 1.422844
C  6.294284 1.896203 0.651306
C  -6.295337 1.893808 -0.65082
C  7.016867 0.927466 1.580448
C  -7.01804 0.92446 -1.579232
H  1.185993 3.531095 -0.315532
H  -1.187136 3.530772 0.314863
H  3.131811 0.408591 -0.818679
H  -3.131792 0.407797 0.819444
H  3.082897 3.23819 -1.687305
H  3.642485 3.135791 0.010422
H  -3.083723 3.237895 1.686277
H  -3.643686 3.134417 -0.011252
H  1.229305 -5.825443 -0.31161
H  -1.226892 -5.825833 0.314085
H  5.525275 3.094626 -1.581818
H  4.879873 1.620461 -2.380527
H  -5.526055 3.093446 1.58153
H  -4.879992 1.619836 2.380727
H  5.709375 0.318864 -0.591878
H  -5.70955 0.317193 0.592865
H  3.011803 -2.702219 -0.771638
H  -3.011032 -2.703219 0.772013
H  6.961272 -0.124482 1.251675
H  8.077416 1.223521 1.654589
H  6.584726 1.007437 2.592639
H  -6.962403 -0.127273 -1.24978
H  -8.078594 1.22047 -1.653443
H  -6.58602 1.003764 -2.591531
