program: Gaussian 09
title: 000149344
version: EM64L-G09RevD.01
frameworkgroup: C1[X(C16H9NO3)]
method: RPBEPBE
basis: SDD
operation: Freq
keyword: #p
keyword: freq=noraman
keyword: PBEPBE/SDD
title: #p freq=noraman PBEPBE/SDD
converged: YES YES YES YES
title: Mulliken charges:
elementType: O O O N C C C C C C C C C C C C C C C C H H H H H H H H H
charge: -0.198049 -0.219218 -0.196457 0.046953 0.339411 0.444481 0.128808 0.420978 -0.615176 0.154220 0.393416 -0.692345 -0.440801 -0.359152 -0.421049 0.256000 -0.429112 -0.415596 -0.236778 -0.237756 0.245320 0.251886 0.254588 0.268795 0.294892 0.247425 0.245494 0.234448 0.234373
chargesum: 0.00000
title: Mulliken charges with hydrogens summed into heavy atoms:
elementType: O O O N C C C C C C C C C C C C C C C C
charge: -0.198049 -0.219218 -0.196457 0.046953 0.339411 0.444481 0.128808 0.420978 -0.369855 0.154220 0.393416 -0.440460 -0.186213 -0.090358 -0.126157 0.256000 -0.181687 -0.170102 -0.002329 -0.003383
polarizability: 4.41765935e+02 1.28891655e-01 2.19318464e+02 -2.57501353e-02 1.67935553e-02 7.00532625e+01
1716.lowfreq: -4.1815 -0.0004 0.0003 0.0007 4.3183 8.4558 50.5026 61.8534 94.6264
frequency: 50.4968 61.8517 94.6263 96.4587 123.7711 193.2422 202.3325 233.9810 262.4684 287.8589 340.4019 353.7187 395.1312 413.6799 432.7707 473.5542 519.3339 519.6703 546.9761 547.3701 571.9809 590.1460 623.2266 633.7777 665.4433 678.0490 707.2733 748.8507 756.8040 770.5923 778.8630 791.2723 811.1248 822.8409 862.0025 881.3317 892.8552 905.1599 908.2863 935.3243 961.7022 966.9932 974.3565 995.4497 1017.9983 1069.6925 1093.9739 1138.5881 1161.1094 1175.3240 1192.3626 1199.1173 1225.9683 1238.5384 1267.8808 1281.4101 1288.5599 1330.1686 1347.6593 1381.0899 1409.5058 1424.2489 1433.0136 1440.1194 1469.4681 1493.8899 1521.9824 1560.7025 1565.5391 1572.8141 1624.7301 1639.7073 3122.5074 3124.8291 3128.2833 3130.2814 3141.0925 3147.7301 3166.3949 3185.7062 3250.0582
redmass: 7.0837 8.2165 6.0955 8.6881 5.5533 5.5022 7.8494 4.9860 7.5784 4.1806 5.1763 6.5883 7.7549 3.3634 6.7669 2.4654 4.6184 6.9199 3.6597 6.2663 4.3587 7.5261 6.7944 6.5573 3.7568 8.7181 8.0816 8.2828 1.2820 3.8386 4.8192 2.1613 1.4776 5.5119 1.4252 1.4694 5.2069 1.4819 8.2676 1.9666 3.4288 1.3912 1.4437 1.3546 2.3006 2.4877 3.0123 1.7904 1.6814 1.0905 1.5600 2.1876 2.7278 2.0052 2.6228 3.0479 1.8795 2.6326 10.9162 2.9371 5.0077 2.4629 3.0451 5.8474 4.6466 4.8391 6.2052 6.2122 6.6408 7.1196 6.6804 6.9272 1.0911 1.0866 1.0911 1.0894 1.0899 1.0950 1.1003 1.0964 1.0990
irintensity: 0.2928 0.0673 0.6953 1.1589 0.5936 2.8324 1.4848 0.9387 0.3433 4.7412 1.0473 1.1463 0.2630 1.5108 5.6889 21.2990 0.1623 0.6820 0.0960 4.4247 0.0068 10.7856 0.1038 6.1602 0.7002 11.7056 5.1312 5.3704 77.1477 0.0415 2.5024 3.8014 7.9514 2.3507 0.0889 28.6183 1.7317 78.4015 7.2330 1.8176 0.2679 0.8354 12.5877 0.0053 4.3324 18.4568 11.9177 16.1846 74.9016 0.9236 87.9687 396.7336 66.5654 31.1386 168.5130 51.4067 11.9782 11.7153 128.7819 9.9834 4.6988 9.1157 7.3219 2.1405 3.5933 97.3952 144.4361 12.6974 3.1791 63.6780 10.6162 11.4540 6.6820 6.2926 2.8442 0.7176 7.3906 26.3639 41.6335 3.0386 3.2903
temp: 298.150 k
press: 1.00000 atm
elementType: 8 8 8 7 6 6 6 6 6 6 6 6 6 6 6 6 6 6 6 6 1 1 1 1 1 1 1 1 1
symmnumber: 1
zpe: 546367.1 jmol-1
zpe.correction: 0.208100 hartree
zpe.thermalcorrener: 0.222363 hartree
zpe.thermalcorrenthalpy: 0.223307 hartree
zpe.thermalcorrgfe: 0.166416 hartree
zpe.sumelectzpe: -894.104395 hartree
zpe.sumelectthermal: -894.090132 hartree
zpe.sumelectthermalent: -894.089188 hartree
zpe.sumelectthermalfe: -894.146079 hartree
dipole: -8.1293 1.9150 0.0012
dipole: 8.3518
quadrupole: -137.6961 -100.8113 -118.3275
quadrupole: 8.3941 0.0050 0.0007
quadrupole: -18.7512 18.1337 0.6175 8.3941 0.0050 0.0007
hfenergy: -894.3124952 hartree
pointgroup: C01 [X(C16H9N1O3)]
dipole: 3.1923008 0.7784655 -0.000474 debye
polarizability: 441.7542822|1.6151057|219.3301166|-0.0256177|-0.0169949|70.0532625 unknown
InChI: InChI=1S/C16H9NO3/c18-17(19)16-9-14-13-8-11-4-2-1-3-10(11)7-12(13)5-6-15(14)20-16/h1-9H
charge 0 multiplicity 1
29 atoms
O  -3.312416 0.932268 0.000005
O  -4.695834 -2.382687 0.000643
O  -5.722596 -0.321276 0.000578
N  -4.676435 -1.0814 0.000337
C  0.271519 0.111495 -0.000102
C  0.851667 1.454478 -0.000271
C  -1.173796 0.029871 -0.000025
C  2.534393 -0.873828 -0.000113
C  1.119542 -1.012089 -0.000031
C  -1.937376 1.224066 -0.00011
C  3.119197 0.461605 -0.000281
C  2.259048 1.590339 -0.000357
C  -0.00536 2.624446 -0.000351
C  -1.395116 2.534493 -0.000273
C  -2.116327 -1.056086 0.000108
C  -3.378077 -0.473336 0.000156
C  3.411205 -2.013883 -0.000035
C  4.552633 0.593563 -0.000363
C  4.794524 -1.849212 -0.000117
C  5.371352 -0.532784 -0.000283
H  0.687664 -2.019975 0.000089
H  2.698461 2.59567 -0.000488
H  0.471415 3.610975 -0.000476
H  -2.04327 3.413746 -0.000326
H  -1.927582 -2.126354 0.000193
H  2.972451 -3.01852 0.000089
H  4.990298 1.5988 -0.000495
H  5.453081 -2.72437 -0.000056
H  6.461034 -0.423016 -0.000346
