program: Gaussian 09
title: 000149345
version: EM64L-G09RevD.01
frameworkgroup: C1[X(C16H9NO3)]
method: RPBEPBE
basis: SDD
operation: Freq
keyword: #p
keyword: freq=noraman
keyword: PBEPBE/SDD
title: #p freq=noraman PBEPBE/SDD
converged: YES YES YES YES
title: Mulliken charges:
elementType: O O O N C C C C C C C C C C C C C C C C H H H H H H H H H
charge: -0.209108 -0.217913 -0.200398 0.050021 0.291684 0.475190 -0.008499 0.305719 0.410700 0.394896 -0.599765 -0.663114 -0.458748 -0.409754 -0.428105 0.272858 -0.417714 -0.415810 -0.236786 -0.235358 0.278150 0.252506 0.247201 0.254784 0.303288 0.250477 0.244469 0.235053 0.234076
chargesum: 0.00000
title: Mulliken charges with hydrogens summed into heavy atoms:
elementType: O O O N C C C C C C C C C C C C C C C C
charge: -0.209108 -0.217913 -0.200398 0.050021 0.291684 0.475190 -0.008499 0.305719 0.410700 0.394896 -0.321615 -0.410607 -0.211547 -0.154970 -0.124817 0.272858 -0.167237 -0.171341 -0.001733 -0.001282
polarizability: 4.38481278e+02 1.51306071e+01 2.23072095e+02 -8.59697423e-03 5.16920184e-03 6.98387010e+01
1716.lowfreq: -4.9286 -4.1037 -0.0010 0.0005 0.0007 2.3871 51.3165 62.3292 91.0343
frequency: 51.3141 62.3268 91.0336 94.1705 123.7623 191.0208 202.0700 234.7072 267.4182 295.9835 329.1534 357.8748 387.2945 411.1931 432.2373 472.2218 513.3495 517.5739 551.3581 555.7834 575.7374 591.7514 621.1955 625.0583 661.6475 678.1215 703.7050 746.8293 757.2024 768.7084 777.2548 789.5325 812.3602 822.0965 862.5769 879.6530 893.7798 903.5211 910.3197 934.7281 970.1340 976.6090 988.0877 995.8097 1017.2822 1071.9591 1084.2763 1130.4615 1157.9771 1174.9156 1183.8340 1190.7655 1222.5661 1246.4166 1272.0545 1283.7094 1312.0028 1330.9278 1348.1303 1363.2953 1406.0063 1425.7684 1426.3295 1446.8540 1458.9948 1493.9102 1521.7265 1552.9553 1565.2371 1585.1570 1632.0239 1638.3022 3122.2706 3125.1936 3130.7412 3135.3916 3144.1999 3148.0243 3166.5564 3167.7926 3249.7705
redmass: 7.7738 7.3771 9.0319 5.6553 6.1579 5.3080 7.7931 5.0319 7.6845 4.4393 5.1555 7.0107 7.2286 3.2607 6.7457 2.4909 6.4531 4.4228 3.6462 7.7523 4.9483 7.1730 6.8865 5.4866 3.5962 9.0328 7.9742 8.5750 1.2828 4.0963 4.4836 2.4155 1.4187 5.8179 1.4185 1.4503 5.4298 8.6178 1.4768 1.9028 1.3778 1.4100 4.2646 1.3554 2.3041 3.8673 2.0373 2.0426 1.5847 1.0968 2.9809 1.3524 1.6048 3.9459 2.1511 1.6168 4.0372 4.0539 8.3924 2.0990 6.1354 3.1800 3.2150 3.7818 4.6806 3.8638 7.1269 6.5380 7.0931 6.2777 6.6967 7.4876 1.0912 1.0869 1.0889 1.0884 1.0923 1.0951 1.1003 1.0973 1.0994
irintensity: 0.0088 0.3012 1.3867 3.4624 0.0766 0.3679 1.1298 0.3589 0.3456 0.4695 4.5928 0.1641 1.2719 0.4681 1.7197 22.8959 3.6217 0.5546 0.5537 1.7001 0.2218 3.5933 3.0503 0.7553 16.4759 3.5198 1.4035 16.7815 65.5855 5.5009 1.7003 0.0001 2.2615 18.9603 0.0022 28.9823 0.1353 8.1273 88.5418 0.2799 4.1569 9.2249 2.3673 0.0018 3.8959 15.0202 4.9341 6.0606 9.5665 2.7271 398.1924 15.5675 15.2051 267.3509 40.8773 1.2471 46.3574 1.8994 126.6011 11.0452 25.7088 0.5115 30.4784 2.3785 4.3382 17.5280 233.8847 19.2643 4.5067 0.2369 2.0029 31.8791 3.7009 6.6232 0.1629 5.4830 0.0035 25.1181 44.5486 12.9766 5.6304
temp: 298.150 k
press: 1.00000 atm
elementType: 8 8 8 7 6 6 6 6 6 6 6 6 6 6 6 6 6 6 6 6 1 1 1 1 1 1 1 1 1
symmnumber: 1
zpe: 546227.1 jmol-1
zpe.correction: 0.208047 hartree
zpe.thermalcorrener: 0.222327 hartree
zpe.thermalcorrenthalpy: 0.223271 hartree
zpe.thermalcorrgfe: 0.166330 hartree
zpe.sumelectzpe: -894.103994 hartree
zpe.sumelectthermal: -894.089714 hartree
zpe.sumelectthermalent: -894.088770 hartree
zpe.sumelectthermalfe: -894.145711 hartree
dipole: -6.4161 4.1994 0.0001
dipole: 7.6682
quadrupole: -123.4787 -104.0582 -118.3543
quadrupole: 17.5161 -0.0004 0.0007
quadrupole: -8.1816 11.2389 -3.0573 17.5161 -0.0004 0.0007
hfenergy: -894.3120408 hartree
pointgroup: C01 [X(C16H9N1O3)]
dipole: 2.512637 1.6698272 -0.0000346 debye
polarizability: 438.6826693|-13.6203202|222.8707038|-0.0085606|-0.0052293|69.838701 unknown
InChI: InChI=1S/C16H9NO3/c18-17(19)15-9-13-6-5-12-7-10-3-1-2-4-11(10)8-14(12)16(13)20-15/h1-9H
charge 0 multiplicity 1
29 atoms
O  -2.047098 -0.863518 -0.00017
O  -5.637751 -0.791972 -0.000112
O  -4.163927 -2.560936 -0.000144
N  -4.439052 -1.297143 -0.000049
C  0.204862 0.233461 -0.000269
C  0.852605 1.545867 -0.000349
C  -1.220368 0.272531 -0.000225
C  -2.001515 1.453959 -0.00024
C  2.392245 -0.891483 -0.000274
C  3.052637 0.409981 -0.000359
C  0.974514 -0.94923 -0.000239
C  2.263212 1.592071 -0.000398
C  0.049317 2.757455 -0.000372
C  -1.337146 2.732854 -0.00032
C  -3.379607 1.035849 -0.000149
C  -3.359921 -0.353051 -0.000117
C  3.201207 -2.082087 -0.000225
C  4.490529 0.456055 -0.000397
C  4.591146 -1.998601 -0.000263
C  5.241856 -0.717026 -0.000351
H  0.467739 -1.920627 -0.000182
H  2.765677 2.567285 -0.000466
H  0.578404 3.71715 -0.000431
H  -1.92063 3.658147 -0.000328
H  -4.275496 1.6512 -0.000123
H  2.702443 -3.058154 -0.000165
H  4.98799 1.433095 -0.000471
H  5.198089 -2.91019 -0.000228
H  6.336139 -0.670042 -0.000382
