program: Gaussian 09
title: 000008914
version: EM64L-G09RevD.01
frameworkgroup: C1[X(C9H20O)]
method: RPBEPBE
basis: SDD
operation: Freq
keyword: #pfreq=noraman
keyword: PBEPBE/SDD
title: #p freq=noraman PBEPBE/SDD
converged: YES YES NO NO
title: Mulliken charges:
elementType: O C C C C C C C C C H H H H H H H H H H H H H H H H H H H H
charge: -0.438466 -0.378877 -0.374292 -0.372273 -0.368381 -0.352887 -0.399208 -0.356428 -0.329258 -0.695898 0.191314 0.192668 0.191444 0.195379 0.189216 0.190447 0.190540 0.194982 0.187597 0.188288 0.217890 0.185081 0.194676 0.195197 0.182080 0.215739 0.215370 0.209859 0.209551 0.328649
chargesum: 0.00000
title: Mulliken charges with hydrogens summed into heavy atoms:
elementType: O C C C C C C C C C
charge: -0.109816 0.005105 0.012532 0.007390 0.017141 0.022998 0.003762 0.033445 0.068561 -0.061118
polarizability: 1.32115526e+02 1.64999324e+00 9.06173911e+01 -2.94116292e-01 -1.37462604e+00 8.55292478e+01
1716.lowfreq: -5.9291 -0.0004 -0.0001 0.0004 10.9148 34.2425 47.8400 48.4378 64.4442
frequency: 34.3598 48.2020 64.4368 79.3203 105.3882 127.4926 128.4777 146.2751 158.4000 214.1888 224.5032 234.0881 314.5017 356.3500 395.1842 466.5298 498.2987 722.5451 727.1032 743.8033 776.1122 824.0935 886.7996 888.0130 943.5168 959.5759 988.8599 1009.9853 1017.9232 1039.1552 1058.2096 1067.9440 1079.7577 1081.3773 1099.7312 1123.5034 1183.9459 1209.4625 1215.6875 1245.2633 1253.2523 1275.5078 1281.7434 1286.2614 1289.2285 1298.2132 1298.6576 1316.5169 1336.5549 1352.0887 1355.2547 1359.4165 1382.3785 1387.8058 1461.5697 1462.5292 1465.5240 1466.5662 1471.5276 1475.7553 1477.2267 1482.8233 1487.9336 1490.6160 2945.0762 2951.4955 2951.8020 2954.0795 2956.0321 2959.9951 2965.7831 2969.6345 2971.8850 2984.9774 2990.5671 2999.2945 3011.5487 3024.5891 3035.4767 3043.8887 3068.2275 3071.2397 3073.0151 3557.4432
redmass: 4.0364 4.1323 1.5439 3.2298 1.6028 3.0165 2.9312 1.8050 2.1396 4.5263 1.1341 3.1229 1.1602 2.8588 4.1226 2.8729 3.2932 1.0602 1.0762 1.1019 1.1350 1.1815 1.8095 1.2548 3.3895 1.3497 4.2873 4.3224 1.1390 3.2442 2.7491 2.6166 2.1951 2.0950 1.3612 2.6251 1.8435 1.3754 1.3980 1.3547 1.3001 1.2320 1.0489 1.2028 1.1071 1.1455 1.0910 1.3052 1.3544 1.4991 1.6785 1.5851 1.2587 1.2171 1.0740 1.0723 1.0673 1.0739 1.0770 1.0426 1.0780 1.0855 1.0917 1.0973 1.0689 1.0587 1.0588 1.0595 1.0609 1.0614 1.0604 1.0589 1.0365 1.0961 1.0976 1.0998 1.1017 1.1020 1.1016 1.1030 1.1007 1.0993 1.0976 1.0661
irintensity: 0.7845 0.3029 2.2275 1.4054 1.6765 0.6167 1.6761 0.6734 0.8424 0.1364 0.0023 1.3456 146.3150 15.4433 7.1042 1.6161 3.2635 15.8778 0.0383 6.1834 0.6091 2.9665 4.4768 3.7146 71.2573 3.7397 1.5522 17.0492 0.1791 7.5331 13.6409 2.5307 2.1115 0.8594 40.5240 1.4169 1.3287 16.4336 1.6761 4.1011 0.1555 3.4736 0.3628 0.9937 0.8191 0.4108 0.0139 3.0437 2.6911 3.4350 0.0059 0.0673 25.1668 11.4554 0.1327 0.0360 0.2181 0.1108 0.7192 12.3540 0.9179 1.4515 0.3308 34.5611 53.0985 0.2919 0.0339 5.5744 4.1503 1.9636 51.3359 216.0527 36.7421 1.2374 1.5424 1.8906 2.6954 3.3375 9.1181 186.2584 96.9729 54.6330 70.7760 6.5642
temp: 298.150 k
press: 1.00000 atm
elementType: 8 6 6 6 6 6 6 6 6 6 1 1 1 1 1 1 1 1 1 1 1 1 1 1 1 1 1 1 1 1
symmnumber: 1
zpe: 718892.1 jmol-1
zpe.correction: 0.273812 hartree
zpe.thermalcorrener: 0.287642 hartree
zpe.thermalcorrenthalpy: 0.288587 hartree
zpe.thermalcorrgfe: 0.232189 hartree
zpe.sumelectzpe: -429.307361 hartree
zpe.sumelectthermal: -429.293530 hartree
zpe.sumelectthermalent: -429.292586 hartree
zpe.sumelectthermalfe: -429.348984 hartree
dipole: 1.8060 -0.2382 1.3237
dipole: 2.2518
quadrupole: -84.6259 -64.8706 -63.4163
quadrupole: 1.6437 -8.3290 -1.6050
quadrupole: -13.6550 6.1003 7.5546 1.6437 -8.3290 -1.6050
hfenergy: -429.5811724 hartree
pointgroup: C01 [X(C9H20O1)]
dipole: -0.7143072 0.0788021 0.5180954 debye
polarizability: 132.1001483|1.7377014|90.5538565|0.6505254|1.5133479|85.6081606 unknown
InChI: InChI=1S/C9H20O/c1-2-3-4-5-6-7-8-9-10/h10H,2-9H2,1H3
charge 0 multiplicity 1
30 atoms
O  5.758058 0.268687 -0.010883
C  -0.636863 -0.405794 0.00013
C  0.669806 0.419125 0.004731
C  -1.911647 0.467871 -0.010066
C  1.943526 -0.456001 0.01365
C  -3.218467 -0.35709 -0.012287
C  3.249651 0.371286 0.018237
C  -4.49408 0.516227 -0.021313
C  4.509662 -0.512489 0.030291
C  -5.794564 -0.316068 -0.020835
H  -0.654861 -1.069501 0.890024
H  -0.644573 -1.074804 -0.885764
H  0.6779 1.087896 0.890967
H  0.687929 1.082874 -0.884705
H  -1.903723 1.138639 0.874655
H  -1.895112 1.129695 -0.901251
H  1.921979 -1.122454 0.901727
H  1.935056 -1.12256 -0.873879
H  -3.236156 -1.020205 0.87813
H  -3.228681 -1.026989 -0.897625
H  3.285363 1.028377 -0.872612
H  3.258092 1.037541 0.90784
H  -4.481748 1.187026 0.862151
H  -4.476121 1.17685 -0.91228
H  4.49572 -1.186609 0.915351
H  4.553661 -1.138176 -0.877619
H  -6.691122 0.330832 -0.026643
H  -5.844853 -0.972167 -0.910431
H  -5.8498 -0.963118 0.875101
H  5.780669 0.869097 0.777007
