program: Gaussian 09
title: 000149400
version: EM64L-G09RevD.01
frameworkgroup: C1[X(C18H22N2O2)]
method: RPBEPBE
basis: SDD
operation: Freq
keyword: #p
keyword: freq=noraman
keyword: PBEPBE/SDD
title: #p freq=noraman PBEPBE/SDD
converged: YES YES NO NO
title: Mulliken charges:
elementType: O O N N C C C C C C C C C C C C C C C C C C H H H H H H H H H H H H H H H H H H H H H H
charge: -0.473906 -0.420025 -0.700626 -0.726346 0.138890 0.145904 -0.537522 -0.535629 0.417777 0.382903 -0.573892 -0.496803 -0.696576 -0.695069 -0.461017 -0.409575 0.349166 0.095735 -0.357933 -0.352732 0.106974 0.161147 0.241569 0.217828 0.212077 0.249732 0.235106 0.255072 0.212896 0.238380 0.205222 0.206418 0.215711 0.232067 0.232023 0.231908 0.210391 0.247110 0.337687 0.302077 0.308410 0.308118 0.360455 0.378899
chargesum: 0.00000
title: Mulliken charges with hydrogens summed into heavy atoms:
elementType: O O N N C C C C C C C C C C C C C C C C C C
charge: -0.113451 -0.041126 -0.060862 -0.109817 0.138890 0.145904 -0.078125 -0.073820 0.417777 0.382903 -0.338787 -0.241731 -0.040079 -0.040873 -0.228994 -0.177667 0.349166 0.095735 -0.147542 -0.105622 0.106974 0.161147
polarizability: 3.45868988e+02 3.92630468e+00 1.74959647e+02 1.45714237e+00 -3.18345193e+00 1.81208344e+02
1716.lowfreq: -4.8508 0.0004 0.0007 0.0008 4.2013 7.1523 26.9529 34.4074 36.6305
frequency: 26.9161 34.3944 36.5362 43.9232 68.4224 91.6725 96.5392 119.5239 134.2656 145.1675 166.7774 193.9146 201.6570 206.2182 226.1010 230.2136 266.3694 286.2054 293.6057 298.4879 301.4131 316.9662 330.9951 351.1278 383.9736 399.7429 420.5768 429.3733 433.7586 438.2773 476.9564 504.3943 533.5776 547.0818 565.7055 582.4080 599.2793 626.4513 658.3305 688.5315 710.1255 725.6558 731.0255 737.6494 756.1826 768.4072 778.2424 787.5277 805.0182 827.5796 835.2153 871.3374 880.4482 893.4709 899.1740 906.7682 948.0548 952.7569 968.6401 1017.4467 1041.6187 1049.9384 1068.6526 1081.9360 1089.8034 1098.0136 1107.0458 1118.6158 1143.0558 1159.3714 1174.2255 1208.3989 1226.9764 1236.4454 1246.3608 1259.5556 1268.3260 1282.3672 1298.2319 1313.5788 1316.5534 1324.6895 1327.3874 1381.0093 1382.3150 1387.8920 1395.0978 1418.0560 1444.0268 1468.2791 1469.8930 1471.5842 1472.0339 1484.3554 1485.0251 1489.2224 1512.8418 1586.7834 1603.3389 1608.9223 1614.8643 1622.7696 1633.6861 1635.6745 2970.4358 2972.1864 2974.9330 2975.6704 3052.8051 3056.4061 3068.0881 3070.0051 3082.2933 3083.0624 3108.2921 3126.6560 3132.1314 3134.7456 3151.6936 3168.7688 3186.8747 3448.8679 3561.3983 3568.1111 3608.5661 3715.9857
redmass: 4.7243 4.2341 3.8898 5.8401 4.0421 2.8777 2.7244 2.0324 3.2270 2.6375 4.5240 1.2613 1.1379 1.8857 3.4720 3.6461 3.6991 2.5224 3.9261 3.5152 1.1640 2.4585 2.0167 1.8878 3.3388 4.1979 4.0174 4.3363 3.0323 2.7008 1.1133 5.2856 3.8359 3.6263 5.4958 5.2225 3.6308 5.1363 3.6072 3.7400 3.1071 1.4074 3.2544 3.4064 5.0067 2.7188 1.5961 1.5012 1.4447 1.3152 1.1796 1.8811 2.4686 1.7032 1.6741 1.5929 2.5719 1.3672 2.0761 2.1219 1.8109 2.3068 1.7631 1.7143 1.7128 1.9034 1.9893 2.2220 1.3026 1.1916 1.6233 1.6973 2.2740 2.2156 1.6688 1.2777 1.4952 1.8796 1.4092 1.4316 1.7739 2.6383 2.7786 1.2107 1.2094 2.6914 6.1997 4.5420 4.0905 1.0740 1.0785 1.0445 1.0529 1.1044 1.0751 2.9801 3.6991 3.4165 5.9099 1.7745 4.5452 5.3582 2.7334 1.4038 1.0668 1.0658 1.0350 1.0352 1.0931 1.0930 1.1000 1.1000 1.0992 1.0993 1.0887 1.0908 1.0902 1.0895 1.0942 1.0955 1.0616 1.0449 1.0975 1.0443 1.0662 1.1046
irintensity: 0.3346 0.1005 1.4321 0.1796 0.9966 0.2069 0.1169 7.9756 1.5998 4.1456 0.0569 0.8433 0.1867 1.1687 3.8760 13.4347 3.9947 29.7611 6.7221 14.4721 96.8664 14.0045 73.1519 122.8139 22.1801 3.1776 9.6923 11.5544 9.4160 13.6469 72.4683 0.9046 4.4506 1.5765 0.1685 15.6361 5.7821 7.0080 3.0240 19.9013 0.2107 189.3392 1.7869 4.2084 7.1656 36.1966 18.4010 40.8983 12.2502 145.1992 26.3650 14.1711 16.9360 6.0533 10.7228 8.4253 2.4945 0.8863 1.4521 0.6699 2.9127 5.9828 1.9272 12.1862 335.8059 4.5814 8.9880 2.9143 1.2595 33.3671 23.7616 92.3795 60.3679 148.7871 0.1697 6.1022 5.6182 20.5143 1.2181 5.9201 25.1255 62.7574 86.0326 10.0340 17.7590 22.0974 0.5495 7.5990 15.1165 7.1271 5.5606 4.9203 1.1301 27.4939 9.7322 150.3789 165.0071 16.6314 9.6006 2.0259 9.8211 24.7596 274.6908 27.8598 26.5338 27.8896 39.7752 29.2425 7.4296 3.2817 55.1383 42.7666 12.2243 97.3522 28.8944 13.3047 11.7540 8.1067 8.7195 9.9732 154.2485 1.5692 11.2287 89.9347 53.8596 32.3678
temp: 298.150 k
press: 1.00000 atm
elementType: 8 8 7 7 6 6 6 6 6 6 6 6 6 6 6 6 6 6 6 6 6 6 1 1 1 1 1 1 1 1 1 1 1 1 1 1 1 1 1 1 1 1 1 1
symmnumber: 1
zpe: 949735.4 jmol-1
zpe.correction: 0.361735 hartree
zpe.thermalcorrener: 0.384453 hartree
zpe.thermalcorrenthalpy: 0.385397 hartree
zpe.thermalcorrgfe: 0.309735 hartree
zpe.sumelectzpe: -957.440494 hartree
zpe.sumelectthermal: -957.417776 hartree
zpe.sumelectthermalent: -957.416832 hartree
zpe.sumelectthermalfe: -957.492494 hartree
dipole: 2.9278 1.1798 2.3590
dipole: 3.9407
quadrupole: -129.9668 -127.3801 -117.1928
quadrupole: -6.1737 -14.9195 -1.3428
quadrupole: -5.1202 -2.5335 7.6538 -6.1737 -14.9195 -1.3428
hfenergy: -957.8022287 hartree
pointgroup: C01 [X(C18H22N2O2)]
dipole: -1.1429204 -0.929733 -0.4827717 debye
polarizability: 345.5431312|0.9525909|181.1126875|8.5031337|-3.2566875|175.38116 unknown
InChI: InChI=1S/C18H22N2O2/c1-3-13(11-5-7-17(21)15(19)9-11)14(4-2)12-6-8-18(22)16(20)10-12/h5-10,21-22H,3-4,19-20H2,1-2H3
charge 0 multiplicity 1
44 atoms
O  -6.134417 0.033019 -0.145244
O  6.16093 0.089551 0.228086
N  -4.621421 -1.888541 0.978372
N  4.763936 -1.853173 -0.967528
C  -0.397304 0.357632 -0.532201
C  0.430246 0.361913 0.572226
C  0.125387 0.4453 -1.967077
C  -0.098965 0.465713 2.004041
C  -1.896033 0.310947 -0.422511
C  1.927165 0.305446 0.462777
C  -2.544639 -0.762625 0.245138
C  2.581542 -0.75499 -0.224693
C  -0.16157 -0.822404 -2.813694
C  0.186782 -0.790277 2.867965
C  -2.697593 1.314529 -1.02883
C  2.746437 1.286989 1.093069
C  -3.957449 -0.847743 0.334908
C  3.986891 -0.818602 -0.295313
C  -4.108597 1.252096 -0.944705
C  4.15435 1.244656 1.027586
C  -4.730273 0.185912 -0.273673
C  4.777867 0.188137 0.329454
H  1.207318 0.66157 -1.968263
H  -0.369888 1.303106 -2.466559
H  0.385068 1.333892 2.497122
H  -1.182107 0.672862 1.993948
H  -1.937125 -1.558999 0.69136
H  1.983004 -1.544657 -0.693787
H  0.189074 -0.687721 -3.853954
H  -1.244088 -1.040547 -2.841944
H  0.348476 -1.70844 -2.391788
H  -0.315385 -1.682215 2.449441
H  -0.178222 -0.646038 3.90179
H  1.269959 -1.00337 2.913902
H  -2.226625 2.160054 -1.540191
H  2.270618 2.117773 1.626646
H  -4.719826 2.041502 -1.40264
H  4.770775 2.014203 1.501363
H  -5.637392 -1.885705 0.999477
H  -4.108315 -2.63634 1.432914
H  4.615308 -1.913375 -1.980454
H  4.726454 -2.777267 -0.523275
H  -6.610436 0.776722 -0.587369
H  6.291779 -0.746897 -0.330691
