program: Gaussian 09
title: 000149370
version: EM64L-G09RevD.01
frameworkgroup: C1[X(C9H14N6S2)]
method: RPBEPBE
basis: SDD
operation: Freq
keyword: #p
keyword: freq=noraman
keyword: PBEPBE/SDD
title: #p freq=noraman PBEPBE/SDD
converged: YES YES NO NO
title: Mulliken charges:
elementType: S S N N N N N N C C C C C C C C C H H H H H H H H H H H H H H
charge: 0.143847 0.156058 -0.361745 -0.035688 -0.427296 -0.097644 -0.575582 -0.057195 -0.296347 -0.688055 -0.822521 0.100839 0.288012 -0.299776 -0.128173 -0.707107 -0.087469 0.245026 0.243860 0.259627 0.269703 0.275999 0.272043 0.340223 0.260266 0.359572 0.321843 0.373828 0.190158 0.255900 0.227795
chargesum: 0.00000
title: Mulliken charges with hydrogens summed into heavy atoms:
elementType: S S N N N N N N C C C C C C C C C
charge: 0.143847 0.156058 -0.021522 -0.035688 -0.067724 -0.097644 0.120089 -0.057195 0.192539 -0.158725 -0.274480 0.100839 0.288012 -0.039509 -0.128173 -0.033255 -0.087469
polarizability: 2.34971732e+02 2.02499562e+01 1.98416395e+02 1.32059896e+01 1.38688642e+00 1.05832230e+02
1716.lowfreq: -8.5534 -3.7739 -0.0013 0.0010 0.0020 6.2305 28.5594 40.1254 52.4412
frequency: 28.5205 40.0751 52.3289 62.0416 76.4359 77.8529 95.8573 106.4809 141.8520 150.9127 176.7259 188.3707 201.6328 227.1983 257.0024 268.7530 301.7439 346.8230 380.3642 400.0918 425.3270 440.5770 445.0272 472.6281 494.0439 507.6843 532.8447 553.8858 566.0027 586.6640 601.3737 604.8278 627.5440 635.6371 676.7178 728.6700 747.4814 784.3289 832.9725 874.8353 882.5191 958.4868 1005.6675 1014.6625 1043.7984 1081.9084 1096.6874 1106.3270 1120.1383 1163.9636 1180.7654 1190.4868 1216.5036 1226.7521 1231.6288 1262.8421 1276.5925 1284.2009 1296.0501 1355.0321 1402.4596 1430.4002 1433.0458 1442.6462 1468.7427 1479.5534 1486.0804 1491.7350 1541.8036 1585.2847 1633.5142 1689.3623 2209.4537 2899.2273 2975.7301 2983.4501 3018.2559 3022.6677 3037.0690 3062.6516 3095.8565 3098.9025 3183.7274 3401.6426 3482.8302 3542.3616 3631.2147
redmass: 4.0633 2.2587 5.3467 9.8307 3.5570 2.6568 4.0380 5.6917 4.9015 5.7295 6.8756 5.1992 4.3681 3.2601 2.4727 3.5281 2.2424 4.4213 3.8509 4.5147 2.8709 1.4371 1.5032 1.4840 4.9617 3.3257 4.5514 4.6964 4.6788 5.2511 4.6229 6.4218 5.6040 5.8722 7.5549 1.4037 3.2164 2.3172 1.4132 1.7082 2.6692 2.0486 2.6304 2.5741 2.4898 1.3446 1.7807 1.6901 2.4982 3.0578 1.9561 1.3896 1.1672 1.4838 1.2734 4.4115 1.7930 1.4229 1.7842 1.4407 1.3687 1.1263 1.1060 1.0960 1.1127 1.1004 1.5688 1.0517 6.6453 2.9774 1.5097 6.9214 12.2634 1.0440 1.0647 1.0932 1.0636 1.0603 1.0908 1.0925 1.1058 1.1056 1.0951 1.0561 1.0788 1.0755 1.0941
irintensity: 0.7914 4.1008 0.4086 0.4756 1.3798 1.7320 1.6053 4.3421 4.1354 6.8713 10.0714 0.4100 13.4736 5.9177 8.0761 2.8170 2.5297 13.3275 22.3134 13.3825 5.2408 40.0042 160.2360 55.2336 17.3583 1.6882 61.5675 16.7269 3.6370 11.3863 3.5793 16.3190 17.7739 25.3712 17.6975 248.8720 85.2151 9.1087 13.2656 8.7515 1.1779 34.3790 14.3055 42.1454 31.4940 0.3124 5.6740 4.6701 7.2746 37.4207 12.3225 3.5567 23.2952 62.1206 16.4470 15.7415 55.5309 51.5118 38.9444 26.6160 46.1900 53.1686 16.6875 10.8290 38.4687 19.9987 118.8227 13.8817 41.6126 205.6394 305.1375 554.1261 241.7018 125.8760 22.8118 58.4058 8.3562 29.6468 26.4852 31.8280 11.7407 7.5446 7.9374 358.8301 191.2712 56.6578 126.6524
temp: 298.150 k
press: 1.00000 atm
elementType: 16 16 7 7 7 7 7 7 6 6 6 6 6 6 6 6 6 1 1 1 1 1 1 1 1 1 1 1 1 1 1
symmnumber: 1
zpe: 618737.4 jmol-1
zpe.correction: 0.235665 hartree
zpe.thermalcorrener: 0.254718 hartree
zpe.thermalcorrenthalpy: 0.255662 hartree
zpe.thermalcorrgfe: 0.186947 hartree
zpe.sumelectzpe: -1474.666012 hartree
zpe.sumelectthermal: -1474.646959 hartree
zpe.sumelectthermalent: -1474.646015 hartree
zpe.sumelectthermalfe: -1474.714731 hartree
dipole: 3.7621 -0.9215 0.2421
dipole: 3.8809
quadrupole: -110.1021 -107.0156 -118.6966
quadrupole: -13.7754 -2.8483 9.0542
quadrupole: 1.8360 4.9225 -6.7585 -13.7754 -2.8483 9.0542
hfenergy: -1474.9016771 hartree
pointgroup: C01 [X(C9H14N6S2)]
dipole: -1.4467706 0.4800114 -0.0880054 debye
polarizability: 239.3856014|16.0334074|193.2308791|-6.14738|-13.3465353|106.6038766 unknown
InChI: InChI=1S/C9H14N6S2/c1-12-9(15-6-10)13-2-3-16-5-7-4-14-8(11)17-7/h4,13,15H,2-3,5,11H2,1H3
charge 0 multiplicity 1
31 atoms
S  0.581071 -3.086719 -0.168342
S  1.689563 0.222927 0.894027
N  -1.69979 -0.65888 -0.016419
N  3.951323 0.529928 -0.533449
N  -2.368061 1.488887 -0.831133
N  -3.987115 -0.28306 -0.430633
N  2.734058 2.582827 -0.163646
N  -0.215405 2.678791 -0.191446
C  -1.973882 -2.01006 0.49766
C  -0.72972 -2.634876 1.142637
C  2.206849 -2.608696 0.770317
C  2.690971 -1.240481 0.454896
C  -2.751235 0.134942 -0.425362
C  3.807649 -0.836242 -0.258722
C  2.933341 1.234377 -0.049593
C  -5.111654 0.616501 -0.722587
C  -1.237588 2.130935 -0.4926
H  -2.782733 -1.931606 1.248554
H  -2.367709 -2.663163 -0.307805
H  -0.267837 -1.93233 1.85798
H  -1.012112 -3.559928 1.670939
H  2.945348 -3.363441 0.453509
H  1.981829 -2.770751 1.83846
H  -0.736876 -0.449481 -0.301859
H  4.564509 -1.523438 -0.642648
H  -3.057034 1.987882 -1.397417
H  3.447498 3.121575 -0.652287
H  1.780337 2.953713 -0.062254
H  -4.979479 1.663313 -0.36193
H  -6.01664 0.217694 -0.233513
H  -5.328873 0.65186 -1.811431
