program: Gaussian 09
title: 000149346
version: EM64L-G09RevD.01
frameworkgroup: C1[X(C17H11NO4)]
method: RPBEPBE
basis: SDD
operation: Freq
keyword: #p
keyword: freq=noraman
keyword: PBEPBE/SDD
title: #p freq=noraman PBEPBE/SDD
converged: YES YES YES YES
title: Mulliken charges:
elementType: O O O O N C C C C C C C C C C C C C C C C C H H H H H H H H H H H
charge: -0.198429 -0.262751 -0.222026 -0.198755 0.046330 0.339603 0.441580 0.130128 0.429878 0.422536 -0.615511 0.151771 -0.696048 -0.441737 -0.361336 -0.424436 -0.570029 -0.440068 0.254808 0.333716 -0.356952 -0.536599 0.246197 0.253354 0.254269 0.267963 0.293682 0.268829 0.245097 0.247438 0.223397 0.223397 0.250704
chargesum: 0.00000
title: Mulliken charges with hydrogens summed into heavy atoms:
elementType: O O O O N C C C C C C C C C C C C C C C C C
charge: -0.198429 -0.262751 -0.222026 -0.198755 0.046330 0.339603 0.441580 0.130128 0.429878 0.422536 -0.369313 0.151771 -0.442694 -0.187468 -0.093373 -0.130754 -0.301200 -0.194971 0.254808 0.333716 -0.109514 0.160899
polarizability: 5.15714020e+02 -6.64204049e+00 2.31683070e+02 -3.64250707e-02 -1.33694930e-03 8.13724193e+01
1716.lowfreq: -7.7304 -6.1992 -3.0382 0.0005 0.0008 0.0011 35.0884 60.0353 63.9108
frequency: 35.0457 60.0242 63.8948 82.3917 102.1469 111.0243 161.4783 171.1951 199.8433 215.2716 232.6727 252.9850 279.6397 297.0706 355.7296 357.5989 397.0048 413.9295 424.8719 464.2806 470.3788 508.0847 521.8606 549.2330 559.0571 569.0092 605.8934 627.5414 641.3328 666.3591 677.0537 707.2237 732.6543 749.3606 763.5583 783.6980 786.6520 805.9948 811.3494 828.8650 866.7046 879.1814 907.1722 907.8360 928.1735 931.2347 959.6172 961.1206 970.6219 998.9295 1073.5521 1095.2974 1108.3948 1142.3593 1151.8437 1161.5304 1175.2147 1198.1834 1214.9556 1226.2757 1238.1593 1269.4796 1282.3706 1284.5305 1319.8645 1345.8899 1374.1549 1407.9625 1413.7917 1431.8329 1434.7933 1447.2439 1468.3016 1470.4946 1470.8955 1498.6196 1520.6051 1555.6171 1564.2888 1571.5881 1628.5059 1641.0570 2963.1721 3053.6254 3124.9865 3127.7289 3128.1156 3131.4127 3141.4974 3155.2252 3166.8981 3184.8338 3250.2545
redmass: 5.3664 6.9375 5.1919 7.7854 5.4628 4.9023 5.6354 4.7681 2.1234 8.7993 1.7414 4.2982 4.8247 4.8801 8.3742 6.1824 5.3160 3.3713 5.8204 6.2415 2.4908 6.5236 4.4498 6.5780 5.3259 4.6533 3.5907 6.9595 6.9510 3.6347 8.5038 8.3566 6.2949 8.3741 3.2527 5.0153 2.2149 1.5897 1.4665 4.9551 1.5280 1.4555 1.5596 8.6069 4.9529 1.8317 3.4705 1.4276 1.4261 3.7533 2.3885 3.2968 1.2561 1.4542 1.6456 1.6955 1.4665 2.8516 1.8320 2.6508 2.1570 3.0161 2.5394 2.1161 2.3563 12.2471 3.6362 4.6226 2.9146 2.0486 2.3509 3.1425 1.0505 1.0724 5.0314 4.2771 6.3014 6.3191 7.8295 6.5085 7.1578 6.8402 1.0329 1.1044 1.0914 1.0958 1.0948 1.0895 1.0897 1.0920 1.0948 1.0964 1.0988
irintensity: 0.0016 2.1141 5.4943 1.3875 0.7909 0.2694 2.7815 0.7135 1.9713 0.0584 3.5286 2.5742 2.3726 2.4918 0.1847 0.1475 0.3328 1.9275 6.6701 3.5642 18.8913 10.3779 0.0506 7.2852 20.3596 0.0871 5.0037 6.0448 0.3279 0.1072 9.7548 10.5109 5.7997 2.4017 3.1339 3.0649 8.9216 44.9723 1.0718 0.6383 0.0600 31.1070 63.1966 10.3317 4.9763 27.7853 0.2581 4.7168 5.0421 73.5035 17.0056 14.7380 0.1571 3.4660 238.0896 40.4811 93.1740 433.0130 158.4838 59.8516 83.8414 363.4594 0.9811 21.1328 7.2131 144.8553 17.1310 2.3531 3.9129 1.7789 17.1745 12.3492 14.1849 85.1559 0.9213 261.3488 112.8953 16.8024 49.7727 15.1889 65.7216 126.6699 97.5211 45.8873 10.6008 18.0765 12.9457 4.4743 7.7006 5.6852 16.7129 3.3261 3.0974
temp: 298.150 k
press: 1.00000 atm
elementType: 8 8 8 8 7 6 6 6 6 6 6 6 6 6 6 6 6 6 6 6 6 6 1 1 1 1 1 1 1 1 1 1 1
symmnumber: 1
zpe: 627855.6 jmol-1
zpe.correction: 0.239138 hartree
zpe.thermalcorrener: 0.256259 hartree
zpe.thermalcorrenthalpy: 0.257203 hartree
zpe.thermalcorrgfe: 0.193724 hartree
zpe.sumelectzpe: -1008.455669 hartree
zpe.sumelectthermal: -1008.438548 hartree
zpe.sumelectthermalent: -1008.437604 hartree
zpe.sumelectthermalfe: -1008.501083 hartree
dipole: -9.4896 0.5733 0.0009
dipole: 9.5069
quadrupole: -149.6567 -112.6814 -129.7107
quadrupole: 23.8918 -0.0002 -0.0023
quadrupole: -18.9738 18.0015 0.9722 23.8918 -0.0002 -0.0023
hfenergy: -1008.694807 hartree
pointgroup: C01 [X(C17H11N1O4)]
dipole: 3.7349706 0.1996367 -0.0003595 debye
polarizability: 515.7925009|4.6711342|231.6045892|-0.0364149|0.0015896|81.3724193 unknown
InChI: InChI=1S/C17H11NO4/c1-21-13-4-2-10-8-14-11(6-12(10)7-13)3-5-16-15(14)9-17(22-16)18(19)20/h2-9H,1H3
charge 0 multiplicity 1
33 atoms
O  -4.01955 0.851388 0.000276
O  6.085517 0.024802 -0.000576
O  -5.273612 -2.514373 0.000338
O  -6.37999 -0.494293 0.000418
N  -5.304379 -1.212691 0.000365
C  -0.406043 0.169278 -0.000025
C  0.124262 1.533591 -0.000052
C  -1.846898 0.031507 0.000088
C  1.893683 -0.723063 -0.000224
C  2.432015 0.633026 -0.000252
C  0.486348 -0.91888 -0.00011
C  -2.6559 1.195341 0.000168
C  1.523628 1.727509 -0.000164
C  -0.778829 2.669523 0.000034
C  -2.163897 2.525685 0.000144
C  -2.747468 -1.089343 0.00014
C  3.850357 0.823839 -0.000371
C  2.8166 -1.822179 -0.000315
C  -4.031188 -0.555521 0.000269
C  4.716539 -0.273112 -0.000462
C  4.193603 -1.614971 -0.000432
C  7.041076 -1.087485 -0.000788
H  0.095938 -1.943685 -0.000091
H  1.921251 2.749766 -0.000184
H  -0.340854 3.673919 0.000008
H  -2.84542 3.379385 0.00021
H  -2.518402 -2.15168 0.000105
H  4.27384 1.833192 -0.000396
H  2.421354 -2.844618 -0.000293
H  4.870865 -2.473843 -0.000499
H  6.932502 -1.714478 -0.906666
H  6.932806 -1.714564 0.905067
H  8.031045 -0.608871 -0.000931
