program: Gaussian 09
title: 000149353
version: EM64L-G09RevD.01
frameworkgroup: C1[X(C19H24N2O)]
method: RPBEPBE
basis: SDD
operation: Freq
keyword: #p
keyword: freq=noraman
keyword: PBEPBE/SDD
title: #p freq=noraman PBEPBE/SDD
converged: NO YES NO NO
title: Mulliken charges:
elementType: O N N C C C C C C C C C C C C C C C C C C C H H H H H H H H H H H H H H H H H H H H H H H H
charge: -0.308611 -0.112731 -0.483351 0.442970 -0.181348 -0.133390 -0.498051 -0.405480 -0.489497 -0.447488 -0.384499 -0.528818 -0.742482 -0.535402 0.232019 0.193036 0.134071 0.203888 -0.421386 -0.367994 -0.259877 -0.223934 0.231044 0.229410 0.235406 0.209888 0.212182 0.209798 0.205824 0.201356 0.199707 0.235376 0.195975 0.251180 0.209085 0.219973 0.222937 0.238117 0.218381 0.208240 0.200858 0.297132 0.225060 0.226026 0.217114 0.218288
chargesum: 0.00000
title: Mulliken charges with hydrogens summed into heavy atoms:
elementType: O N N C C C C C C C C C C C C C C C C C C C
charge: -0.308611 -0.112731 -0.186219 0.442970 0.049696 0.096019 -0.052757 0.016500 -0.082317 -0.012406 0.044558 -0.081663 -0.063047 -0.126305 0.232019 0.193036 0.134071 0.203888 -0.196326 -0.141968 -0.042763 -0.005646
polarizability: 2.78772019e+02 -1.80221560e+00 2.17918658e+02 2.73624194e+01 6.58105344e+00 1.51233226e+02
1716.lowfreq: -4.0583 -0.0007 -0.0006 -0.0004 3.4135 13.4216 27.0360 60.1050 73.1484
frequency: 26.2624 60.0662 73.0919 78.9291 93.6625 110.3379 155.3844 173.7573 190.7331 218.6561 238.1829 259.2432 272.0487 284.3250 292.3692 310.0439 340.6084 352.0878 371.7596 394.5646 424.0693 430.0516 442.5596 472.3578 489.3402 500.5201 502.3763 521.0080 544.6438 566.4624 590.2119 627.2916 642.5167 688.6563 696.7537 709.2756 745.3498 751.5216 765.2363 768.4929 794.4732 808.0251 830.9292 846.4668 874.3097 877.0786 893.8689 911.6106 925.0646 930.4519 949.9322 965.5808 966.0702 970.8222 993.2213 1010.6728 1018.4068 1024.7273 1032.5359 1047.2288 1058.4640 1091.5000 1101.3686 1111.1446 1126.7322 1137.4179 1151.0544 1157.4242 1168.6774 1175.5609 1203.9839 1208.2663 1224.0442 1240.3693 1245.4719 1249.2050 1270.7626 1277.3829 1298.9850 1306.9198 1311.7482 1319.4514 1329.3830 1333.5382 1342.7701 1347.1899 1352.8320 1357.3450 1371.7479 1382.6657 1397.5601 1404.5175 1409.0839 1428.5450 1435.3548 1455.7416 1460.7768 1462.0699 1462.8862 1469.3015 1471.5276 1473.5505 1480.5244 1485.6710 1490.9325 1576.0565 1589.6614 1631.5226 2845.5412 2860.8279 2948.5519 2949.6352 2964.5768 2970.7526 2974.8169 2982.7651 3007.6998 3014.7920 3017.3324 3031.7668 3032.1995 3053.3062 3066.6071 3074.5150 3079.1427 3080.1779 3098.2345 3118.9406 3125.8096 3140.5086 3159.8962 3600.8789
redmass: 4.4420 3.0521 3.4694 4.0622 2.4757 4.2135 4.4171 3.3559 2.2241 4.2337 2.7318 1.8123 2.7685 3.0827 2.0493 2.7499 2.2618 2.8879 2.8273 2.9809 2.7288 3.6517 2.8322 3.3466 3.1244 1.4073 3.3355 2.7330 3.1371 3.5250 3.3780 3.7747 5.0064 3.5890 4.0934 5.9137 1.4401 2.8739 3.4750 1.5400 3.6373 2.0630 3.0273 1.5012 2.7412 4.0508 2.2474 2.6857 1.3947 2.1985 2.4502 1.3186 1.9466 2.2947 2.1252 2.0664 1.8762 2.0159 1.8728 2.2284 2.0534 2.0251 1.6894 1.8491 1.8847 2.3420 1.4429 1.7677 1.2123 2.2978 1.3850 1.5545 1.2498 1.2856 1.5636 1.5092 1.3035 1.6952 1.4577 2.4732 1.4114 1.2956 1.3277 1.7063 1.4537 1.3472 1.4785 1.5652 1.5891 1.4240 1.2303 2.7431 4.2074 2.5555 1.1375 1.0778 1.0930 1.4149 1.0841 1.3077 1.6858 1.1452 3.1562 1.0557 1.0438 7.2102 6.3927 6.9074 1.0708 1.0705 1.0611 1.0647 1.0635 1.0614 1.0617 1.0364 1.0981 1.0998 1.0900 1.1018 1.0988 1.0894 1.0878 1.0985 1.0915 1.0989 1.0930 1.0847 1.0888 1.0948 1.1000 1.0800
irintensity: 0.2813 0.1979 1.1604 0.1905 2.5523 1.0655 1.5651 1.9817 2.2897 0.7418 2.6955 1.5224 1.4396 5.7856 0.9247 2.0008 0.6094 4.4186 3.8751 3.7387 1.3698 4.9865 2.4029 1.0407 7.9380 70.9375 7.2698 14.3540 0.9561 0.7366 7.0484 6.5002 1.0370 4.4175 7.3826 12.7834 87.9802 5.0578 9.6111 14.5156 25.0103 5.4519 1.7238 0.0808 3.5424 1.0312 3.9686 0.8716 1.9658 4.7720 13.2869 0.1583 7.9238 2.7216 2.4954 14.1883 3.4434 26.3797 6.0367 11.3876 4.4206 10.5009 6.5024 3.7061 34.3541 0.9149 5.7930 16.9698 1.8564 13.1898 0.5441 6.7617 8.4777 0.7194 11.0553 1.8910 2.1178 16.8437 0.8593 23.2017 4.7982 10.2510 7.9870 36.1819 1.1247 6.1663 4.1517 14.1105 1.6767 7.5868 24.9641 3.4426 34.8256 14.3658 12.6655 0.9284 1.6184 12.5758 4.2936 14.0476 36.4186 12.3337 9.2378 8.7595 8.9200 5.0907 7.0083 2.1838 109.6596 109.9753 87.9121 14.9592 53.8238 28.2139 35.1547 33.6936 18.2106 47.9919 55.2578 39.5323 6.1442 27.7382 31.5748 47.2859 0.8464 50.2596 56.4318 3.6236 3.1329 38.8460 37.8020 35.6610
temp: 298.150 k
press: 1.00000 atm
elementType: 8 7 7 6 6 6 6 6 6 6 6 6 6 6 6 6 6 6 6 6 6 6 1 1 1 1 1 1 1 1 1 1 1 1 1 1 1 1 1 1 1 1 1 1 1 1
symmnumber: 1
zpe: 1028096.1 jmol-1
zpe.correction: 0.391581 hartree
zpe.thermalcorrener: 0.410621 hartree
zpe.thermalcorrenthalpy: 0.411565 hartree
zpe.thermalcorrgfe: 0.345204 hartree
zpe.sumelectzpe: -921.469726 hartree
zpe.sumelectthermal: -921.450686 hartree
zpe.sumelectthermalent: -921.449742 hartree
zpe.sumelectthermalfe: -921.516102 hartree
dipole: 0.3140 0.9226 1.5820
dipole: 1.8580
quadrupole: -148.6244 -115.7956 -132.0340
quadrupole: -2.0953 8.9911 2.6088
quadrupole: -16.4731 16.3557 0.1174 -2.0953 8.9911 2.6088
hfenergy: -921.8613068 hartree
pointgroup: C01 [X(C19H24N2O1)]
dipole: -0.1149579 0.374515 -0.6171727 debye
polarizability: 278.6063814|0.3659844|218.0748429|27.7401936|-6.0242822|151.2426789 unknown
InChI: InChI=1S/C19H24N2O/c1-2-19-9-7-16-14(13-5-3-4-6-15(13)20-16)8-10-21(12-19)11-17-18(19)22-17/h3-6,17-18,20H,2,7-12H2,1H3
charge 0 multiplicity 1
46 atoms
O  -4.566357 -0.515716 0.422039
N  -1.433778 -1.524142 0.261735
N  1.766999 1.443754 -0.838998
C  -2.360103 0.815502 0.26739
C  -3.557072 0.194857 -0.462021
C  -3.737282 -1.2882 -0.589472
C  -1.610941 -0.301011 1.06381
C  -2.689365 -2.237063 -0.017673
C  -1.44186 1.539054 -0.772868
C  -2.892402 1.858727 1.304807
C  -0.251231 -2.36436 0.540061
C  -0.48844 0.66516 -1.657283
C  -3.656737 3.068924 0.724158
C  0.846721 -2.188059 -0.550712
C  0.85554 0.380325 -1.035614
C  1.448933 -0.803485 -0.575215
C  2.76671 -0.451451 -0.06821
C  2.940976 0.966964 -0.250334
C  3.82303 -1.199207 0.517051
C  4.123135 1.64005 0.125479
C  5.005418 -0.533743 0.898113
C  5.154883 0.871251 0.704309
H  -4.032084 0.834904 -1.220735
H  -4.345694 -1.67217 -1.41869
H  -0.615599 0.073655 1.357011
H  -2.184849 -0.506819 2.002385
H  -3.125663 -2.731511 0.888331
H  -2.486385 -3.032348 -0.759694
H  -0.83242 2.285209 -0.221887
H  -2.094017 2.123645 -1.452562
H  -2.027504 2.221595 1.897959
H  -3.560009 1.320649 2.004336
H  -0.327911 1.205744 -2.614402
H  -0.978899 -0.293701 -1.88951
H  -0.553684 -3.430879 0.57485
H  0.179084 -2.124822 1.534422
H  -3.025342 3.686023 0.059666
H  -4.545679 2.746487 0.152482
H  -4.011623 3.721696 1.54215
H  0.388187 -2.438708 -1.527011
H  1.647929 -2.933465 -0.374403
H  1.591107 2.408987 -1.110069
H  3.724777 -2.280305 0.67012
H  4.243071 2.719451 -0.022646
H  5.827303 -1.10047 1.350038
H  6.086729 1.360524 1.009407
