program: Gaussian 09
title: 000149349
version: EM64L-G09RevD.01
frameworkgroup: C1[X(C14H22O7)]
method: RPBEPBE
basis: SDD
operation: Freq
keyword: #pfreq=noraman
keyword: PBEPBE/SDD
title: #p freq=noraman PBEPBE/SDD
converged: YES YES NO NO
title: Mulliken charges:
elementType: O O O O O O O C C C C C C C C C C C C C C H H H H H H H H H H H H H H H H H H H H H H
charge: -0.305172 -0.279284 -0.278459 -0.275823 -0.276335 -0.225120 -0.225656 -0.164914 -0.166634 -0.104023 -0.103176 -0.022419 -0.021973 -0.341208 -0.340675 0.329606 0.329714 -0.696074 -0.674422 -0.696520 -0.674508 0.254143 0.254471 0.238991 0.239229 0.284632 0.284360 0.208166 0.251167 0.208313 0.250995 0.252514 0.217132 0.218345 0.228232 0.226949 0.225872 0.217306 0.218316 0.252482 0.226067 0.228291 0.227102
chargesum: 0.00000
title: Mulliken charges with hydrogens summed into heavy atoms:
elementType: O O O O O O O C C C C C C C C C C C C C C
charge: -0.305172 -0.279284 -0.278459 -0.275823 -0.276335 -0.225120 -0.225656 0.089229 0.087837 0.134968 0.136053 0.262213 0.262388 0.118125 0.118634 0.329606 0.329714 -0.008084 0.006631 -0.008416 0.006952
polarizability: 2.17209986e+02 -7.70754435e+00 1.50349417e+02 1.62532661e-02 3.94470606e-02 1.37490147e+02
1716.lowfreq: -10.3626 -2.5721 -0.0006 0.0001 0.0006 4.6027 25.9340 28.1777 36.3971
frequency: 24.7644 28.0959 36.3670 55.0337 77.2542 83.0306 108.0423 121.6332 157.1328 171.1817 171.8102 186.7524 220.6707 229.1849 236.8518 264.3747 292.6082 293.6093 295.7280 297.5875 307.3148 363.7537 387.6254 429.8845 437.2936 477.4183 478.2867 539.4559 547.0706 595.0337 598.1457 636.4915 637.6491 720.6099 727.0314 754.3886 759.4603 760.0500 775.2512 796.9692 804.4301 835.4896 839.1222 857.8270 864.7135 890.8281 891.3238 907.1222 912.2254 921.7847 923.2030 947.9860 951.5855 959.2791 972.7647 986.0651 986.7548 998.5830 1004.5726 1026.9755 1037.6186 1053.7227 1056.1091 1071.4621 1084.2721 1141.2820 1141.3848 1181.4153 1182.7525 1195.0045 1196.7121 1202.0786 1203.5087 1234.7831 1255.0041 1261.1246 1263.5375 1269.3843 1270.5216 1293.1411 1297.5446 1297.8634 1303.4747 1313.8452 1332.5385 1340.5660 1343.0180 1377.1142 1377.9516 1392.3098 1392.4933 1448.6879 1449.3118 1453.0918 1453.1192 1453.8138 1453.9883 1470.8406 1471.0435 1473.4469 1473.7988 2992.3440 2992.5812 3001.6218 3001.8616 3008.7406 3008.8630 3025.4274 3026.0194 3051.6221 3052.1705 3089.8473 3091.2541 3091.3134 3092.5586 3100.9625 3101.1360 3111.2603 3111.5515 3117.0198 3118.0655 3123.9522 3124.0520
redmass: 4.9478 3.8926 4.0301 3.9636 4.6527 4.0521 4.2926 4.6255 4.2476 1.0305 1.0524 5.2257 1.8367 1.0821 1.5652 4.6734 2.2872 2.7440 2.6859 3.3441 3.4895 2.8508 3.5493 2.5478 2.8267 3.8622 3.8524 6.1494 6.7777 4.2346 4.3931 6.4511 5.7324 5.6554 4.6927 5.1258 7.2070 5.1429 4.1303 5.8495 5.3463 3.6904 3.7590 4.2832 3.9388 2.9270 3.2082 5.8602 4.5717 1.5426 1.6260 2.2298 2.2105 3.5504 2.8241 1.3894 1.3564 4.9366 5.9474 2.4864 2.4684 3.0436 2.9238 2.0818 1.9433 1.8679 1.8665 1.1537 1.1581 2.2802 2.4037 1.8690 1.8001 1.2289 1.2580 1.3563 1.3738 2.9230 3.0704 1.4089 1.1807 1.2893 1.3365 1.5919 1.6736 1.3122 1.3062 1.2817 1.2845 1.2448 1.2430 1.0857 1.0859 1.0506 1.0508 1.0485 1.0485 1.0640 1.0647 1.0472 1.0467 1.0354 1.0355 1.0668 1.0669 1.0356 1.0356 1.0842 1.0844 1.0877 1.0879 1.0885 1.0996 1.0997 1.0887 1.1005 1.1005 1.0997 1.0997 1.1009 1.1010 1.1009 1.1009
irintensity: 0.1268 0.1218 0.0494 1.9614 1.7647 4.1238 0.1137 3.0959 0.0641 0.1538 0.0064 19.5192 2.7438 0.1337 0.8986 2.6729 0.2083 0.7415 16.6089 0.3893 5.3101 1.5182 3.5145 0.5159 4.3394 21.5398 1.2991 4.5384 10.6264 0.8834 1.5186 23.8526 5.1623 14.0013 4.4541 9.9083 14.5988 7.5813 61.8023 172.9926 0.4672 37.4829 3.3261 63.0649 27.8066 6.8031 20.1555 508.1727 12.8276 6.2212 2.0428 24.6381 1.9287 0.0157 2.4042 17.8209 1.8505 0.7323 381.8454 12.7499 9.8544 82.6658 1.6703 37.1999 0.6857 49.0680 31.4235 6.2714 0.0499 187.9267 37.9251 29.1547 4.4953 6.3730 0.2558 1.0649 0.3071 42.4627 40.0755 14.5563 1.2219 0.1002 0.0490 19.7997 0.9826 1.5838 0.2593 42.5033 48.8880 44.2904 16.9955 13.8794 4.0493 1.4083 8.1488 0.6688 0.9159 1.0987 0.8658 14.9124 16.8123 10.1658 11.0798 27.1033 22.5278 14.2513 10.4019 46.8089 44.1416 25.2067 61.5703 17.6522 48.9231 17.7935 0.5946 4.4294 4.3292 25.2080 28.7073 13.5034 12.6115 19.8252 16.6035
temp: 298.150 k
press: 1.00000 atm
elementType: 8 8 8 8 8 8 8 6 6 6 6 6 6 6 6 6 6 6 6 6 6 1 1 1 1 1 1 1 1 1 1 1 1 1 1 1 1 1 1 1 1 1 1
symmnumber: 1
zpe: 920899.9 jmol-1
zpe.correction: 0.350752 hartree
zpe.thermalcorrener: 0.371466 hartree
zpe.thermalcorrenthalpy: 0.372410 hartree
zpe.thermalcorrgfe: 0.300325 hartree
zpe.sumelectzpe: -1071.549983 hartree
zpe.sumelectthermal: -1071.529269 hartree
zpe.sumelectthermalent: -1071.528325 hartree
zpe.sumelectthermalfe: -1071.600410 hartree
dipole: -0.0063 0.0305 4.2789
dipole: 4.2790
quadrupole: -111.7517 -123.8990 -124.6170
quadrupole: -4.6085 0.0308 0.1030
quadrupole: 8.3375 -3.8097 -4.5278 -4.6085 0.0308 0.1030
hfenergy: -1071.9007351 hartree
pointgroup: C01 [X(C14H22O7)]
dipole: -0.0616169 0.2688793 -1.6607451 debye
polarizability: 216.6476654|9.8240967|150.5409051|-1.1924675|1.8957022|137.8609795 unknown
InChI: InChI=1S/C14H22O7/c1-13(2)18-7-5-15-11(9(7)20-13)17-12-10-8(6-16-12)19-14(3,4)21-10/h7-12H,5-6H2,1-4H3
charge 0 multiplicity 1
43 atoms
O  0.015562 -0.055217 -0.201358
O  3.441633 1.048868 0.279633
O  -3.386822 -1.27406 0.158335
O  4.395169 -1.01069 -0.314579
O  -4.347493 0.860802 0.296946
O  1.582869 -1.392238 1.067883
O  -1.433854 0.792746 1.541493
C  2.377527 0.314297 -0.420798
C  -2.360726 -0.352563 -0.352381
C  3.015192 -1.058859 -0.836086
C  -2.999866 1.078992 -0.264639
C  1.267443 -0.060085 0.57771
C  -1.176298 -0.309205 0.62876
C  2.202605 -2.118376 -0.071449
C  -2.125885 1.841321 0.747356
C  4.736545 0.413388 -0.082649
C  -4.692776 -0.566618 0.090012
C  5.660814 0.493574 1.125434
C  5.300395 1.049636 -1.364733
C  -5.547224 -1.028521 1.263232
C  -5.338251 -0.770451 -1.291563
H  1.980554 0.901642 -1.26577
H  -2.0369 -0.640786 -1.366596
H  3.024469 -1.225096 -1.928422
H  -3.071273 1.587032 -1.243162
H  1.185948 0.601831 1.454009
H  -1.042861 -1.216358 1.238719
H  1.413768 -2.554894 -0.713147
H  2.840276 -2.906807 0.354376
H  -1.380267 2.477073 0.233023
H  -2.726761 2.436652 1.450403
H  5.178806 0.005943 1.987264
H  6.615017 -0.015367 0.90829
H  5.867557 1.547753 1.375562
H  5.5083 2.120152 -1.196225
H  6.236512 0.543781 -1.65721
H  4.580246 0.961363 -2.197663
H  -6.504012 -0.479743 1.27507
H  -5.756416 -2.108188 1.178217
H  -5.009724 -0.838027 2.205351
H  -4.667768 -0.41841 -2.095724
H  -5.548602 -1.840939 -1.457248
H  -6.283827 -0.204948 -1.353477
