program: Gaussian 09
title: 000149340
version: EM64L-G09RevD.01
frameworkgroup: C1[X(C7H11N3O3)]
method: RPBEPBE
basis: SDD
operation: Freq
keyword: #p
keyword: freq=noraman
keyword: PBEPBE/SDD
title: #p freq=noraman PBEPBE/SDD
converged: YES YES NO NO
title: Mulliken charges:
elementType: O O O N N N C C C C C C C H H H H H H H H H H H
charge: -0.447973 -0.209635 -0.232010 -0.175904 -0.202744 0.039478 0.298577 -0.482548 0.178275 0.162939 -0.624282 -0.324206 -0.753668 0.215702 0.255149 0.271742 0.267905 0.233534 0.190547 0.216037 0.253617 0.241972 0.252085 0.375412
chargesum: 0.00000
title: Mulliken charges with hydrogens summed into heavy atoms:
elementType: O O O N N N C C C C C C C
charge: -0.072561 -0.209635 -0.232010 -0.175904 -0.202744 0.039478 0.298577 -0.011698 0.178275 0.162939 0.148899 0.082379 -0.005995
polarizability: 1.56549073e+02 1.06685322e+00 1.25256490e+02 -3.60264351e-01 -3.35476532e-01 6.23309070e+01
1716.lowfreq: -10.9151 -7.7738 -2.6624 -0.0010 -0.0005 -0.0003 38.2137 56.7770 95.2789
frequency: 38.1963 56.7712 95.2699 123.8095 136.6615 146.7882 155.1101 195.6748 217.6615 250.6708 273.8689 308.2789 335.7517 378.3514 401.0766 478.6769 577.0971 605.3086 622.9533 639.2300 683.8278 700.7010 724.8374 750.7111 832.3874 858.0991 944.4005 986.9038 1025.4006 1040.9986 1050.9919 1069.6241 1113.7057 1123.5646 1137.3150 1186.3308 1214.4481 1260.9150 1304.9755 1310.5144 1332.8826 1353.3245 1361.6646 1400.0632 1406.0065 1420.7762 1437.8443 1449.0258 1450.7472 1463.4389 1464.2054 1470.2680 1476.1112 1494.9379 1527.1798 2955.6150 2976.6038 2998.8540 3027.2279 3032.8624 3074.6659 3076.0765 3120.2563 3126.4190 3137.5836 3315.1516
redmass: 6.0004 5.8250 3.3899 1.0921 2.9395 1.4933 2.1301 4.3628 3.1777 5.3348 3.3938 2.9766 3.5133 6.2311 5.0174 3.8165 4.0269 4.2328 5.3808 4.2751 3.3587 8.1562 1.2718 8.9952 3.2270 2.7626 1.9300 2.1885 4.3834 1.5236 1.8813 2.6674 2.6505 1.3255 3.8393 1.1362 1.3704 5.8278 3.6690 1.7371 7.3914 5.0564 1.3063 2.5499 1.2338 1.3383 1.1590 1.8279 1.0485 1.1091 1.0718 1.2748 1.1386 1.7681 9.7867 1.0694 1.0591 1.0374 1.0344 1.0978 1.0958 1.0960 1.1006 1.1023 1.1024 1.0655
irintensity: 6.6104 0.2001 2.7463 0.3546 4.6532 1.8044 2.7578 3.0795 4.1178 3.9497 1.0471 6.8579 0.8954 0.4806 1.2193 2.4855 3.2236 1.5645 4.4751 1.6122 39.8811 2.0734 160.8476 28.6944 5.0929 10.0052 18.0826 20.5327 88.4274 5.6336 10.7824 1.2484 59.5660 1.1456 76.3833 25.1233 53.2847 62.3651 23.1590 0.8062 148.2465 254.2181 6.6935 156.8313 25.3982 18.3342 37.6692 15.6958 17.5464 4.0262 8.6073 16.0062 9.0280 34.4437 89.3915 72.9874 14.4444 4.1499 14.7241 25.5399 54.4315 6.5498 12.3808 6.7619 7.7397 211.7549
temp: 298.150 k
press: 1.00000 atm
elementType: 8 8 8 7 7 7 6 6 6 6 6 6 6 1 1 1 1 1 1 1 1 1 1 1
symmnumber: 1
zpe: 488720.3 jmol-1
zpe.correction: 0.186144 hartree
zpe.thermalcorrener: 0.199370 hartree
zpe.thermalcorrenthalpy: 0.200314 hartree
zpe.thermalcorrgfe: 0.145804 hartree
zpe.sumelectzpe: -662.183967 hartree
zpe.sumelectthermal: -662.170741 hartree
zpe.sumelectthermalent: -662.169797 hartree
zpe.sumelectthermalfe: -662.224307 hartree
dipole: -1.6705 -3.2238 0.9311
dipole: 3.7483
quadrupole: -105.8475 -67.9226 -75.4690
quadrupole: 11.2366 -4.6100 0.9150
quadrupole: -22.7678 15.1571 7.6107 11.2366 -4.6100 0.9150
hfenergy: -662.3701109 hartree
pointgroup: C01 [X(C7H11N3O3)]
dipole: -0.777111 1.2471737 -0.1242324 debye
dipolederiv: -0.689726 -0.0663201 -0.1207935 -0.1288767 -0.7408568 0.0472823 -0.0962817 0.0550453 -0.5360374 -0.8593175 0.1584506 0.0415167 0.3615515 -0.5644247 -0.0671348 0.0772591 -0.0611764 -0.2423083 -0.6291979 -0.1602586 -0.0196466 -0.328475 -0.8653474 -0.10461 -0.0415673 -0.10522 -0.2604278 -0.1073815 -0.0756838 -0.0215048 -0.1717035 -0.6723506 -0.1169013 -0.0051438 -0.1220345 -0.0901429 -0.9183084 0.1794994 0.0436891 0.4083034 -0.5759448 -0.0761684 0.152349 -0.0783975 -0.2671743 1.9441396 0.2370805 0.0066473 0.1513052 1.2324331 0.1736897 -0.0105492 0.1708486 0.2374169 0.4904382 0.1130982 0.0113901 -0.388018 0.4642647 0.1009107 -0.2028563 0.1010209 0.0589799 -0.2080071 -0.0920936 -0.0470847 -0.0452085 -0.0705221 -0.0656249 0.0209014 -0.0980755 0.0647179 -1.0451186 -0.4304308 -0.068079 -0.5131047 -0.0763882 -0.0082574 -0.0966508 -0.0109548 0.0091974 0.6817789 -0.1764581 -0.0456828 0.2119997 0.5327239 0.0993517 0.0245262 0.096808 0.0691452 0.1323469 -0.0116486 -0.0117522 0.0140944 0.3810986 0.0418256 -0.0122036 0.0300508 0.1824239 0.4717394 0.0292755 0.055771 0.1413348 0.5724485 -0.1074592 0.1537624 -0.0530979 0.4341658 0.0474662 0.2410358 0.0500496 0.0835548 -0.1476149 -0.0370553 0.025759 -0.0355052 0.0161747 -0.0003332 -0.0366234 0.019463 0.0014288 -0.1155354 0.0773724 -0.0298368 0.0915998 0.061056 -0.0083722 0.0227481 0.0042539 0.0452451 0.0927138 -0.0264122 0.0181759 -0.0586928 -0.0808106 0.0655561 -0.0477198 -0.089911 0.0190602 0.0505798 0.013601 -0.0544723 -0.0123767 0.0002144 0.087412 -0.0659395 0.0488198 -0.0109172 0.0149952 0.0149841 0.0453605 0.0554491 -0.0104758 -0.0608733 0.1282958 0.0507059 0.031013 0.0643483 -0.0098866 0.0259811 -0.0075323 0.1086306 0.0764637 -0.0255765 0.0662334 -0.0314207 -0.0169801 0.0148315 -0.0334375 0.0403699 -0.2337568 -0.1636732 0.0879166 0.0039142 0.0712958 0.0121965 0.009983 0.0475959 -0.0215378 0.0816843 0.0391774 0.0258991 -0.0839633 -0.0042594 0.0497455 -0.0006928 -0.0784559 0.0352065 0.0011572 0.0064466 -0.1456268 -0.0297356 -0.0570563 0.0029772 -0.0248189 -0.0100396 -0.0220785 0.1140322 0.0402032 -0.0122846 0.0867784 -0.034888 0.0562354 0.0278444 0.0698185 -0.0103195 -0.0076665 0.6071406 0.1233645 0.048921 0.1737412 0.3192042 0.0233455 0.0100056 0.0206009 0.289804 unknown
polarizability: 156.447571|2.0630667|123.4005073|-1.6627405|10.8198113|64.2883914 unknown
InChI: InChI=1S/C7H11N3O3/c1-5-7(10(12)13)9(2)6(8-5)3-4-11/h11H,3-4H2,1-2H3
charge 0 multiplicity 1
24 atoms
O  -3.592232 -1.365518 0.389776
O  3.300303 -0.607881 -0.099557
O  2.835486 1.602298 0.2993
N  0.044026 1.00353 0.292098
N  -0.916507 -1.012309 -0.109856
N  2.46622 0.368711 0.093355
C  -1.147103 0.308979 0.166445
C  -2.523902 0.891926 0.328398
C  1.075287 0.058588 0.071726
C  0.457587 -1.190243 -0.175639
C  0.176604 2.437823 0.620036
C  -3.604989 -0.060916 -0.254626
C  1.076865 -2.519875 -0.466987
H  -2.595052 1.877698 -0.172133
H  -2.737189 1.051172 1.404715
H  0.806089 2.569519 1.512274
H  0.64671 2.985492 -0.210872
H  -0.828481 2.841171 0.814472
H  -3.459604 -0.148193 -1.353183
H  -4.603603 0.36669 -0.064235
H  1.735556 -2.843997 0.358025
H  0.282094 -3.2668 -0.618936
H  1.718534 -2.475221 -1.364777
H  -2.6742 -1.737047 0.219681
