program: Gaussian 09
title: 000149352
version: EM64L-G09RevD.01
frameworkgroup: C1[X(C24H12N4)]
method: RPBEPBE
basis: SDD
operation: Freq
keyword: #pfreq=noraman
keyword: PBEPBE/SDD
title: #p freq=noraman PBEPBE/SDD
converged: NO NO NO NO
title: Mulliken charges:
elementType: N N N N C C C C C C C C C C C C C C C C C C C C C C C C H H H H H H H H H H H H
charge: 0.084904 0.084909 0.089195 0.089196 0.214008 0.214002 -0.293524 -0.293525 -0.246507 -0.246501 0.399396 0.399396 0.268656 0.268656 -0.076284 -0.076287 -0.305564 -0.305564 -0.372559 -0.372559 -0.393181 -0.393182 -0.325833 -0.325831 -0.254414 -0.254414 -0.232753 -0.232754 0.224297 0.224296 0.227100 0.227101 0.247886 0.247885 0.275659 0.275659 0.232889 0.232888 0.236630 0.236630
chargesum: 0.00000
title: Mulliken charges with hydrogens summed into heavy atoms:
elementType: N N N N C C C C C C C C C C C C C C C C C C C C C C C C
charge: 0.084904 0.084909 0.089195 0.089196 0.214008 0.214002 -0.293524 -0.293525 -0.246507 -0.246501 0.399396 0.399396 0.268656 0.268656 -0.076284 -0.076287 -0.081268 -0.081268 -0.145459 -0.145457 -0.145295 -0.145297 -0.050175 -0.050172 -0.021525 -0.021526 0.003877 0.003876
polarizability: 5.68346930e+02 -1.98202868e-04 3.76050831e+02 6.98762961e-04 -3.21943597e-03 1.03319315e+02
1716.lowfreq: -2.7785 -0.0010 0.0007 0.0013 6.3986 12.2859 33.8355 49.6423 82.6404
frequency: 33.8324 49.5916 82.6404 99.5281 122.6572 126.4668 141.2182 217.7690 235.9294 240.3456 266.2628 279.0316 282.8825 300.1737 305.4819 338.4188 411.6712 416.9798 444.3545 448.0691 450.6340 496.8324 504.4920 514.3704 516.7636 523.4629 543.1146 548.6261 584.7577 606.6917 610.8686 633.4570 641.2026 643.2969 669.0796 708.0123 756.6733 759.9365 764.9388 767.5149 777.4969 778.6023 805.0326 820.9411 829.8288 834.2900 851.9885 852.3291 875.4105 886.0148 888.2292 936.7908 965.4437 965.4736 970.9351 971.4876 999.2664 999.5870 1002.0018 1009.1816 1011.0353 1026.7195 1033.4399 1052.6748 1086.6277 1100.0790 1110.2766 1126.5090 1164.5379 1173.1115 1184.5349 1208.3704 1242.2443 1258.3220 1268.4593 1283.3631 1290.9505 1295.2723 1303.9843 1341.2166 1346.9943 1355.8301 1367.1763 1375.7620 1390.8508 1400.5201 1406.7607 1421.2706 1443.7482 1447.1361 1459.1397 1469.1234 1486.6621 1498.1196 1519.2236 1543.3579 1559.0191 1560.6570 1566.5172 1580.8177 1614.4067 1616.4168 3128.4490 3128.7764 3131.2112 3131.3487 3142.9995 3143.0481 3158.5022 3158.5692 3167.2009 3167.4341 3173.7815 3173.9436
redmass: 5.5523 5.4519 4.4429 5.2408 5.9743 5.9577 4.6859 5.0532 6.1499 5.3251 5.5611 6.7805 6.3214 6.2117 7.7616 5.2456 8.0675 3.9925 6.5530 3.6082 4.1204 3.3635 6.2342 8.3343 3.9294 9.2087 8.8456 3.4559 4.0274 7.7570 7.6112 7.5763 7.5864 5.5597 3.8666 6.8205 3.2310 8.4305 2.8994 7.3399 1.3839 1.4735 6.1044 2.7109 6.7770 7.0558 1.6325 1.5431 7.0183 1.6285 1.7944 8.9274 1.4159 1.4423 1.4634 1.3952 1.4281 1.3388 6.0089 5.8877 7.4371 2.1941 2.2344 4.2249 2.4591 2.2513 1.9103 1.6066 1.5294 1.1282 1.5903 1.9840 1.8164 2.4564 1.8207 4.1794 3.6187 2.4439 3.8079 4.1522 3.4261 2.3812 3.4309 5.5008 6.0296 3.5575 6.8654 6.5051 2.4846 2.6317 3.2759 3.8753 3.9298 3.7076 6.8903 8.5267 7.1574 7.4665 6.4384 7.5992 6.3761 6.4762 1.0883 1.0882 1.0863 1.0865 1.0903 1.0903 1.0959 1.0959 1.0949 1.0949 1.0989 1.0989
irintensity: 0.0000 3.4654 0.0000 0.0421 1.5060 0.0000 2.0434 0.0000 2.8634 0.2603 3.0569 0.2337 0.0000 2.2252 0.0140 0.0000 0.4150 12.9681 1.8235 6.0903 0.0000 0.0000 6.5581 0.7429 0.0567 1.3639 6.7275 0.0000 0.1616 3.4460 4.9067 2.2062 1.8842 1.7767 0.0000 6.1507 45.5840 8.6712 0.0000 1.3605 0.0000 152.8265 0.0000 13.5283 0.0016 0.0007 41.3120 0.0005 0.0886 0.0000 3.5244 10.5093 3.4581 0.0003 0.0000 0.8426 0.0000 0.4913 0.0000 0.3455 3.6871 5.6161 15.6309 0.9953 9.7950 1.0756 0.2003 14.6115 0.0323 0.0021 0.2409 13.8595 0.4988 2.7409 0.0262 14.3048 32.2746 1.2215 6.6997 1.1056 5.6743 5.7145 5.2401 1.9608 6.8778 0.0169 59.7842 3.6885 1.8963 3.7585 18.3400 0.2397 8.8403 9.7031 0.4447 58.1715 9.6001 7.2920 107.2154 0.0012 0.1512 7.1452 18.4274 23.7512 3.7074 7.9828 0.5064 15.1571 38.6338 0.5273 46.2898 21.6107 37.1351 16.6808
temp: 298.150 k
press: 1.00000 atm
elementType: 7 7 7 7 6 6 6 6 6 6 6 6 6 6 6 6 6 6 6 6 6 6 6 6 6 6 6 6 1 1 1 1 1 1 1 1 1 1 1 1
symmnumber: 1
zpe: 771022.3 jmol-1
zpe.correction: 0.293667 hartree
zpe.thermalcorrener: 0.311836 hartree
zpe.thermalcorrenthalpy: 0.312780 hartree
zpe.thermalcorrgfe: 0.247763 hartree
zpe.sumelectzpe: -1138.995034 hartree
zpe.sumelectthermal: -1138.976865 hartree
zpe.sumelectthermalent: -1138.975921 hartree
zpe.sumelectthermalfe: -1139.040938 hartree
dipole: 0.0000 -1.5655 0.0000
dipole: 1.5655
quadrupole: -103.4179 -159.7836 -165.4736
quadrupole: 0.0000 -0.0003 -0.0002
quadrupole: 39.4738 -16.8919 -22.5819 0.0000 -0.0003 -0.0002
hfenergy: -1139.2887008 hartree
pointgroup: C01 [X(C24H12N4)]
dipole: 0.0000028 0.6159028 -0.0000004 debye
polarizability: 568.3469302|-0.0004396|376.0508309|-0.0006988|-0.0032194|103.3193151 unknown
InChI: InChI=1S/C24H12N4/c1-3-7-17-13(5-1)15-9-11-25-21-19(15)23(27-17)24-20-16(10-12-26-22(20)21)14-6-2-4-8-18(14)28-24/h1-12H
charge 0 multiplicity 1
40 atoms
N  -1.384844 1.628257 -0.000073
N  1.384849 1.628246 -0.000149
N  -1.385099 -3.288155 -0.000069
N  1.385076 -3.288161 -0.000026
C  -1.44366 -0.829088 -0.000067
C  1.443649 -0.829098 -0.000068
C  -0.743072 0.448877 -0.000068
C  0.743069 0.448872 -0.000099
C  -0.742564 -2.086803 -0.000041
C  0.742546 -2.086805 -0.000053
C  -2.882387 -0.837533 -0.000076
C  2.88238 -0.837552 -0.000066
C  -3.584225 0.440665 -0.000074
C  3.584222 0.440644 -0.000099
C  -2.776027 1.639735 -0.000075
C  2.776028 1.639718 -0.000143
C  -3.531309 -2.105517 -0.000076
C  3.531291 -2.105541 -0.000041
C  -5.002462 0.570454 -0.000069
C  5.002459 0.570421 -0.000088
C  -2.75359 -3.274233 -0.000097
C  2.753562 -3.27425 -0.000021
C  -3.412992 2.919791 -0.000068
C  3.413001 2.919773 -0.000186
C  -5.607135 1.836578 -0.000074
C  5.60714 1.836542 -0.000112
C  -4.809024 3.018888 -0.000072
C  4.809034 3.018861 -0.00017
H  -4.621787 -2.186042 -0.000071
H  4.621769 -2.186078 -0.000036
H  -5.636342 -0.322484 -0.000085
H  5.63633 -0.322521 -0.000052
H  -3.233394 -4.2598 -0.000087
H  3.233368 -4.259817 0.000004
H  -2.765099 3.801321 -0.00007
H  2.765109 3.801303 -0.000221
H  -6.699747 1.917624 -0.000087
H  6.699754 1.917586 -0.000095
H  -5.291408 4.002327 -0.000077
H  5.291429 4.002295 -0.000202
