program: Gaussian 09
title: 000149334
version: EM64L-G09RevD.01
frameworkgroup: C1[X(C5H6FN3O2)]
method: RPBEPBE
basis: SDD
operation: Freq
keyword: #p
keyword: freq=noraman
keyword: PBEPBE/SDD
title: #p freq=noraman PBEPBE/SDD
converged: NO NO NO NO
title: Mulliken charges:
elementType: F O O N N N C C C C C H H H H H H
charge: -0.122526 -0.188806 -0.230380 -0.173909 -0.068468 0.046254 0.258107 0.212679 -0.620672 0.093078 -0.759791 0.237978 0.271932 0.271832 0.282523 0.245103 0.245067
chargesum: 0.00000
title: Mulliken charges with hydrogens summed into heavy atoms:
elementType: F O O N N N C C C C C
charge: -0.122526 -0.188806 -0.230380 -0.173909 -0.068468 0.046254 0.258107 0.212679 0.161070 0.093078 0.012902
polarizability: 1.19783520e+02 3.40967000e+00 9.75217545e+01 -7.13274200e-03 4.40732587e-03 4.24742388e+01
1716.lowfreq: -4.2750 -0.0006 -0.0001 0.0002 8.8659 9.3309 54.2694 93.9500 129.7675
frequency: 54.2157 93.9425 129.7590 154.1431 189.0118 189.5886 246.1318 283.2808 320.1475 357.2080 382.8651 410.1813 568.6849 610.7936 627.6107 645.8969 667.4834 705.1081 745.5469 854.8567 992.7506 1040.7918 1045.7410 1114.8312 1122.4624 1162.4902 1265.3442 1313.4519 1336.3699 1366.0449 1395.9991 1401.7433 1443.8913 1454.1568 1467.7662 1474.5369 1482.6738 1498.6811 1530.6173 2990.7479 3027.1794 3067.9699 3125.2989 3128.6748 3140.0130
redmass: 8.0197 3.4532 1.0965 1.1657 3.1061 9.5113 6.0148 4.4818 3.0095 6.7847 8.3874 7.7164 7.4110 4.5708 7.7683 6.6171 7.1625 12.4171 12.2225 4.4962 1.8522 3.8968 1.4854 3.2474 1.3231 3.5025 9.6423 7.6018 10.0393 6.0014 3.2282 1.3299 1.3345 1.0410 1.3779 1.0425 1.3390 2.2190 11.5945 1.0393 1.0328 1.0981 1.1022 1.0970 1.1027
irintensity: 1.3543 1.8474 0.2560 0.2492 0.8007 3.0681 2.1044 0.2261 3.1714 4.4151 1.4167 0.6526 13.2226 2.1208 1.1053 1.6012 0.5575 8.2002 13.3213 3.4237 3.2148 10.0499 3.5457 64.1632 0.6683 87.3535 59.3938 10.7817 86.7612 315.1513 129.7982 47.7184 49.4281 30.8687 0.5332 4.4264 12.3637 35.9662 196.6447 9.9285 14.3387 11.1203 6.2037 2.4349 7.6629
temp: 298.150 k
press: 1.00000 atm
elementType: 9 8 8 7 7 7 6 6 6 6 6 1 1 1 1 1 1
symmnumber: 1
zpe: 308796.1 jmol-1
zpe.correction: 0.117614 hartree
zpe.thermalcorrener: 0.128069 hartree
zpe.thermalcorrenthalpy: 0.129013 hartree
zpe.thermalcorrgfe: 0.081208 hartree
zpe.sumelectzpe: -607.750341 hartree
zpe.sumelectthermal: -607.739886 hartree
zpe.sumelectthermalent: -607.738942 hartree
zpe.sumelectthermalfe: -607.786747 hartree
dipole: 6.2373 -3.5041 -0.0026
dipole: 7.1542
quadrupole: -66.4966 -68.7510 -60.7959
quadrupole: -7.3694 0.0079 0.0003
quadrupole: -1.1487 -3.4032 4.5519 -7.3694 0.0079 0.0003
hfenergy: -607.8679553 hartree
pointgroup: C01 [X(C5H6F1N3O2)]
dipole: 2.2843543 1.6444458 0.0011704 debye
dipolederiv: -0.2684758 -0.3562725 0.0001636 -0.1786337 -0.8394468 0.0003045 0.0000163 0.0002364 -0.1189062 -0.8594183 -0.1539443 0.0000893 -0.2997714 -0.4950128 0.0003404 -0.0011588 -0.0006722 -0.2243965 -0.5671716 0.099503 -0.0001235 0.2238668 -0.8736832 -0.0003195 -0.0004792 0.0010937 -0.2408926 -0.0317236 0.0530074 0.0001177 0.1166779 -0.6663018 0.000132 0.0002233 0.0001054 -0.0681514 -0.9386173 -0.2231185 -0.0001685 -0.3861526 -0.5516894 -0.0000437 -0.0001253 0.0000909 -0.2355094 1.8723326 -0.2189806 0.0005741 -0.1668188 1.2480162 -0.0002089 0.0012368 -0.0003055 0.2321816 0.5238586 -0.0614624 -0.000014 0.4662088 0.5988329 0.0000502 -0.0001905 -0.0002292 0.0201152 -0.9380612 0.4744244 -0.0006576 0.5443383 -0.1906084 0.00032 0.0000097 0.0000438 0.0106067 0.1436833 0.0438343 -0.0000803 0.0139953 0.3600031 0.0001033 -0.0001902 0.0001899 0.1773898 1.0213657 0.3579839 0.0000407 -0.1598728 1.1673292 -0.0005573 0.0003781 -0.0002782 0.1908209 -0.1810396 -0.0201159 -0.0000463 -0.1601293 -0.0079262 0.0000601 0.0003274 0.0000833 0.066875 -0.0848937 -0.1053771 0.0001881 -0.0088506 0.0784393 -0.0000231 0.0001117 -0.0000417 0.11549 0.088826 0.0519251 -0.0708652 -0.007316 0.0343507 0.0097093 -0.0503776 0.0391149 -0.0100004 0.0888194 0.0518188 0.0707474 -0.0072962 0.0341086 -0.0098364 0.0503669 -0.0394062 -0.0102747 0.0773154 0.0361476 -0.0000702 0.1132382 0.0083041 0.00017 -0.000203 0.0001331 0.1367767 0.0265858 -0.0147398 -0.0061497 -0.0517861 0.0478567 0.1004466 0.0414237 0.0956395 -0.0212289 0.0266144 -0.0146335 0.0062543 -0.0516978 0.0474278 -0.1006475 -0.0413695 -0.0957981 -0.0208958 unknown
polarizability: 120.2629628|-0.849958|97.0422951|0.032828|-0.0153276|42.4742557 unknown
InChI: InChI=1S/C5H6FN3O2/c1-3-7-4(6)5(8(3)2)9(10)11/h1-2H3
charge 0 multiplicity 1
17 atoms
F  -0.678243 -2.517765 0.000937
O  -2.775195 -0.483949 -0.001804
O  -2.069929 1.70103 -0.00167
N  0.647383 0.806203 0.000162
N  1.390074 -1.347744 0.000857
N  -1.845635 0.415212 0.00033
C  1.756154 -0.028887 0.000518
C  -0.492432 -0.035977 0.000312
C  0.679534 2.283039 -0.000451
C  0.029651 -1.344412 0.000686
C  3.176729 0.437258 0.000499
H  1.732683 2.60114 -0.001271
H  0.166348 2.679776 -0.889239
H  0.16748 2.680529 0.888664
H  3.822035 -0.453528 0.001592
H  3.417964 1.041158 -0.893503
H  3.4174 1.043017 0.893381
