program: Gaussian 09
title: 000149329
version: EM64L-G09RevD.01
frameworkgroup: C1[X(C7H11N3O3)]
method: RPBEPBE
basis: SDD
operation: Freq
keyword: #p
keyword: freq=noraman
keyword: PBEPBE/SDD
title: #p freq=noraman PBEPBE/SDD
converged: YES YES NO NO
title: Mulliken charges:
elementType: O O O N N N C C C C C C C H H H H H H H H H H H
charge: -0.438191 -0.223294 -0.232113 -0.174373 -0.108234 0.037305 0.198972 0.201641 -0.579501 0.220374 -0.623371 -0.302946 -0.780519 0.236139 0.248890 0.200137 0.241529 0.267506 0.268458 0.235810 0.241653 0.244993 0.276657 0.342479
chargesum: 0.00000
title: Mulliken charges with hydrogens summed into heavy atoms:
elementType: O O O N N N C C C C C C C
charge: -0.095712 -0.223294 -0.232113 -0.174373 -0.108234 0.037305 0.198972 0.201641 -0.094472 0.220374 0.148403 0.138719 -0.017216
polarizability: 1.34027753e+02 -5.56274339e+00 1.36748076e+02 1.06114330e+01 5.74035648e+00 6.90741249e+01
1716.lowfreq: -10.8958 -0.0007 -0.0004 0.0002 7.4307 10.2968 31.2610 56.6238 70.1485
frequency: 30.8777 56.5711 70.1464 94.6552 126.5150 136.3872 168.3705 192.3223 226.3340 242.0546 274.2299 298.5756 319.4532 348.4067 387.4441 409.8753 468.0260 572.0874 585.4009 635.6165 649.8687 683.8407 728.7556 746.6868 835.8460 847.9145 948.5141 972.3467 1001.3741 1031.9120 1045.3723 1058.7463 1110.9768 1122.9882 1139.6328 1168.4295 1216.3759 1267.4123 1292.1877 1314.2457 1334.2026 1336.2361 1358.3536 1380.9306 1396.4085 1404.1541 1441.9299 1444.0860 1457.4547 1467.5893 1477.1930 1481.4246 1484.4850 1496.2025 1530.1278 2963.4807 2986.7104 3008.2180 3023.9213 3062.9428 3074.4052 3094.8685 3122.3426 3123.6822 3132.9579 3557.6122
redmass: 4.9045 6.6518 4.3126 3.5827 1.0909 2.4207 1.1449 3.5078 3.9945 2.7838 2.2407 1.8662 2.8183 4.2590 4.4852 6.3038 3.9248 3.2578 4.2984 5.3008 5.3264 7.5205 5.6292 10.1815 3.9285 2.6473 2.1683 2.2541 1.8754 3.9588 1.5071 1.9999 2.8076 1.3231 1.5085 2.9515 1.2519 5.8042 2.1374 3.2728 1.5008 3.7329 2.0949 1.4567 1.4063 2.5043 1.1551 1.3634 1.0444 1.3391 1.0434 1.1121 1.3556 2.0666 7.4892 1.0691 1.0394 1.0606 1.0330 1.0979 1.0997 1.0970 1.1022 1.0968 1.1023 1.0661
irintensity: 2.4089 0.1105 4.6618 5.2990 0.3512 6.9909 0.2245 14.5633 16.3069 58.1764 78.5323 72.6371 11.0147 3.0938 0.4289 1.2022 12.1113 0.6854 2.6839 7.5162 2.2942 2.1063 3.6988 10.1387 6.9350 13.0147 3.7991 11.2352 21.5791 45.3542 2.0987 16.5321 99.4759 0.5129 25.9613 69.4558 26.2225 72.6335 10.2845 141.7951 28.2748 65.6456 116.8643 44.3099 10.4589 119.9688 14.3963 43.6764 29.5247 3.3010 3.3559 13.2870 14.1380 50.6044 70.5911 87.0556 14.2067 26.0018 19.3625 12.1029 2.5615 21.7873 7.5000 3.8956 8.7908 6.6405
temp: 298.150 k
press: 1.00000 atm
elementType: 8 8 8 7 7 7 6 6 6 6 6 6 6 1 1 1 1 1 1 1 1 1 1 1
symmnumber: 1
zpe: 487291.0 jmol-1
zpe.correction: 0.185599 hartree
zpe.thermalcorrener: 0.199252 hartree
zpe.thermalcorrenthalpy: 0.200196 hartree
zpe.thermalcorrgfe: 0.144427 hartree
zpe.sumelectzpe: -662.178460 hartree
zpe.sumelectthermal: -662.164808 hartree
zpe.sumelectthermalent: -662.163864 hartree
zpe.sumelectthermalfe: -662.219633 hartree
dipole: 3.8478 -3.5106 -1.2328
dipole: 5.3525
quadrupole: -63.3712 -87.5417 -79.3859
quadrupole: -3.3360 7.3760 0.8120
quadrupole: 13.3950 -10.7754 -2.6196 -3.3360 7.3760 0.8120
hfenergy: -662.3640598 hartree
pointgroup: C01 [X(C7H11N3O3)]
dipole: -1.2371403 -1.6277605 0.5043775 debye
dipolederiv: -0.6872332 0.0298653 0.1117862 0.0925572 -0.5090276 -0.3285533 0.2203637 -0.2860707 -0.4116898 -0.6845565 -0.3680411 -0.0737192 -0.1948816 -0.7415578 -0.0051272 -0.0772819 -0.0486386 -0.2486896 -0.8025865 0.3401939 -0.1416409 0.1958749 -0.6860214 0.0759857 -0.1554962 0.1286148 -0.2826752 -0.6431844 0.2151846 -0.1714282 0.1412573 -0.1128008 0.061375 -0.1935909 0.0444398 -0.1292944 -0.6977921 -0.4665094 -0.0676996 -0.2496654 -0.6502255 0.0084945 -0.1279066 -0.1081195 -0.2777971 1.2059995 -0.0183648 0.2129127 -0.1108097 1.879045 -0.1620724 0.2469603 -0.187304 0.2655917 0.4995009 -0.2415441 0.0831715 0.2264206 0.6069926 -0.0424631 0.1155028 -0.1211222 0.0009552 0.1019629 0.2830144 0.007735 0.2367257 -1.0938726 0.1537709 -0.0123498 0.2332228 0.0134866 -0.2456069 0.005516 0.0942462 -0.175068 0.0944858 -0.0269216 0.2704592 -0.1342921 -0.0476337 0.5951363 0.4472413 0.1243288 -0.0766033 0.4032627 -0.074191 0.1933252 0.1220122 0.0926551 0.3749159 -0.0364289 0.0568405 -0.0220058 0.1503524 0.0035575 0.0603437 -0.0067853 0.1973609 0.4977265 0.0068495 -0.0595575 0.0153421 0.4743548 0.2019426 -0.2984873 0.2624974 0.4063996 -0.062354 -0.1896059 -0.02167 -0.0587885 -0.1082845 0.0007146 -0.0451966 -0.0406911 0.0604199 0.0080686 0.0380053 -0.0258659 0.0838021 -0.0117832 0.1278665 -0.0438843 0.0688544 0.0279473 0.0624689 0.038402 0.020361 -0.0190293 -0.0203917 -0.1011086 -0.008583 -0.044423 0.0482611 -0.2637922 -0.074269 -0.0695925 -0.0418677 0.0148798 -0.0553869 -0.0303676 -0.088693 -0.007056 0.0998544 0.0713965 -0.0430192 0.0095036 -0.0461693 0.047708 -0.0468142 0.0521914 -0.0056396 0.0259834 0.0218642 0.0063509 0.0932793 0.0566449 -0.0529098 0.037735 -0.0593545 0.0058954 0.0430386 -0.0170634 0.0326705 0.0416174 0.0757678 0.0806195 -0.0092996 0.0480376 -0.0246564 0.0276826 -0.0478475 -0.0213357 -0.1455372 -0.0447808 -0.0353587 -0.0147713 -0.0044095 0.1085337 -0.0532564 -0.0510611 0.0944854 0.0057662 0.0378125 -0.0393101 0.1017849 -0.0005279 0.0439182 0.0701363 -0.0547335 -0.0520727 -0.0381917 0.0425716 0.0135249 -0.0717955 -0.0476085 -0.0773344 0.0642557 0.1205564 -0.0386885 0.0393098 0.0260351 0.0267347 -0.0263444 0.0524302 0.1147763 0.4636316 -0.0526206 -0.058599 -0.0490079 0.1627102 0.1211081 -0.0843058 0.165739 0.1262652 unknown
polarizability: 131.7629821|5.0038307|138.4925676|12.243409|-5.1367097|69.5944038 unknown
InChI: InChI=1S/C7H11N3O3/c1-5-8-6(3-4-11)7(9(5)2)10(12)13/h11H,3-4H2,1-2H3
charge 0 multiplicity 1
24 atoms
O  2.971377 -0.922174 -1.208691
O  0.673542 2.597591 0.166832
O  -1.55489 2.491337 -0.359696
N  -1.469385 -0.348324 -0.105326
N  0.283875 -1.615945 0.598653
N  -0.425554 1.930121 -0.028031
C  0.700191 -0.291169 0.575278
C  -0.376887 0.516312 0.139159
C  2.107517 0.080591 0.929007
C  -1.016167 -1.628268 0.182977
C  -2.821446 0.000765 -0.583229
C  3.009784 0.246626 -0.324318
C  -1.841665 -2.8687 0.050485
H  2.511909 -0.727183 1.567765
H  2.133606 1.029645 1.492325
H  4.046616 0.457712 0.012906
H  2.660598 1.090669 -0.939917
H  -3.330541 0.659376 0.136621
H  -2.766139 0.530838 -1.546054
H  -3.394376 -0.930852 -0.706225
H  -2.74408 -2.843299 0.688889
H  -2.169324 -3.041936 -0.991421
H  -1.220796 -3.721927 0.361953
H  3.022336 -1.746904 -0.661442
