program: Gaussian 09
title: 000008913
version: EM64L-G09RevD.01
frameworkgroup: C1[X(C7H16N2O2)]
method: RPBEPBE
basis: SDD
operation: Freq
keyword: #p
keyword: freq=noraman
keyword: PBEPBE/SDD
title: #p freq=noraman PBEPBE/SDD
converged: YES YES NO NO
title: Mulliken charges:
elementType: O O N N C C C C C C C H H H H H H H H H H H H H H H H
charge: -0.462112 -0.288752 -0.336042 -0.570650 -0.360259 -0.371205 -0.352797 -0.357302 -0.400676 -0.393812 0.217244 0.198484 0.191356 0.194036 0.189243 0.187568 0.219690 0.217824 0.183316 0.249876 0.220392 0.205981 0.179114 0.323719 0.258959 0.272290 0.384515
chargesum: 0.00000
title: Mulliken charges with hydrogens summed into heavy atoms:
elementType: O O N N C C C C C C C
charge: -0.077598 -0.288752 -0.012322 -0.039401 0.029581 0.012075 0.054461 0.043838 0.069591 -0.008717 0.217244
polarizability: 1.28344111e+02 -3.78274957e+00 8.65541528e+01 6.40984578e+00 2.64031559e+00 7.84943795e+01
1716.lowfreq: -6.2550 -0.0001 0.0005 0.0008 5.5518 16.2012 19.0396 36.7319 54.1969
frequency: 17.9408 35.8600 54.1326 59.4973 96.2427 105.4405 125.4437 146.8824 208.8861 224.2074 249.1475 272.6236 365.8700 412.1758 477.4367 488.0178 520.3949 583.7769 607.6930 610.0032 700.1519 730.1388 747.7501 787.6293 854.1516 907.7352 951.3206 986.8617 992.2137 1035.4412 1049.9560 1064.0436 1078.3295 1097.2584 1119.6747 1154.4003 1175.8372 1201.1485 1226.8117 1251.0241 1268.5599 1280.1278 1284.7869 1293.3889 1294.9885 1306.5144 1337.2419 1357.8044 1372.0925 1388.6242 1458.0795 1463.4712 1464.8186 1473.0475 1484.4577 1493.4701 1505.5040 1637.8527 1696.7016 2862.5865 2953.2121 2955.8734 2963.0626 2972.3290 2991.7397 2994.2441 3005.6074 3014.2081 3037.0139 3048.0531 3075.6244 3450.1211 3572.0519 3577.5604 3586.5723
redmass: 4.8754 2.6421 5.5450 2.4253 2.1054 4.5551 2.1149 2.0761 2.4799 3.0331 1.5219 3.4712 3.1080 4.1692 1.2291 2.2983 3.2236 1.2073 1.4129 3.2354 11.9096 1.0681 1.1199 1.2350 1.5769 2.0575 2.1025 1.4498 4.3696 3.2223 2.2457 2.7348 2.1945 2.9919 2.0561 1.5809 2.1161 1.4012 1.3719 1.3520 1.4813 1.0522 1.3784 1.1045 1.2554 1.1407 1.3887 1.6439 1.3593 1.4655 1.0739 1.0817 1.0637 1.0960 1.1013 1.0910 1.9337 1.0941 7.5233 1.0715 1.0594 1.0618 1.0621 1.0616 1.0914 1.0706 1.0856 1.0990 1.1001 1.1022 1.1020 1.0448 1.0773 1.0974 1.0651
irintensity: 3.1228 2.1909 1.6995 2.0687 0.7206 0.7157 2.0465 0.6317 10.7369 9.7730 36.9821 5.5729 9.6975 20.6990 203.5190 59.0701 36.1415 47.5515 191.0675 37.7519 32.1857 13.9715 0.3739 3.4369 5.2561 9.5744 6.9604 0.2927 59.3830 60.4948 59.6461 59.7269 0.7984 8.5943 14.0981 36.5712 127.9330 0.5948 19.4055 2.8453 1.7411 0.8827 28.5193 0.9998 3.3932 17.1281 1.7720 0.4303 2.4407 17.3112 6.8185 3.6074 0.4061 3.1972 14.1323 7.9359 232.8634 39.7290 358.4826 113.5554 0.5246 2.9597 54.0346 62.9741 7.1889 40.9822 44.5196 1.5686 2.1898 146.2127 31.6076 1.9296 33.9836 0.1499 49.1558
temp: 298.150 k
press: 1.00000 atm
elementType: 8 8 7 7 6 6 6 6 6 6 6 1 1 1 1 1 1 1 1 1 1 1 1 1 1 1 1
symmnumber: 1
zpe: 614252.2 jmol-1
zpe.correction: 0.233956 hartree
zpe.thermalcorrener: 0.247847 hartree
zpe.thermalcorrenthalpy: 0.248791 hartree
zpe.thermalcorrgfe: 0.190780 hartree
zpe.sumelectzpe: -535.393370 hartree
zpe.sumelectthermal: -535.379480 hartree
zpe.sumelectthermalent: -535.378535 hartree
zpe.sumelectthermalfe: -535.436547 hartree
dipole: 1.3202 -1.3654 -1.0635
dipole: 2.1768
quadrupole: -65.9488 -69.2769 -68.6276
quadrupole: 11.2211 -2.2277 -0.8427
quadrupole: 2.0023 -1.3258 -0.6765 11.2211 -2.2277 -0.8427
hfenergy: -535.6273264 hartree
pointgroup: C01 [X(C7H16N2O2)]
dipole: 0.5212985 -0.2081166 -0.6468148 debye
polarizability: 128.5301153|-6.0460823|81.4670357|3.102511|4.7903577|83.3954927 unknown
InChI: InChI=1S/C7H16N2O2/c8-5-3-1-2-4-6-9-7(10)11/h9-10H,1-6,8H2
charge 0 multiplicity 1
27 atoms
O  -4.949839 0.171396 -0.731036
O  -3.699552 1.083187 1.042236
N  -2.922778 -0.742341 -0.228654
N  5.909783 0.270654 0.250067
C  0.908155 -0.4929 0.359664
C  2.101781 0.095236 -0.426215
C  -0.443646 -0.302953 -0.363883
C  3.454061 -0.104757 0.293076
C  -1.623348 -0.890013 0.444794
C  4.645475 0.493249 -0.482303
C  -3.816279 0.236815 0.118004
H  0.859449 -0.016037 1.360637
H  1.085986 -1.574365 0.537211
H  1.927695 1.178075 -0.597581
H  2.146816 -0.376096 -1.430401
H  -0.399945 -0.785487 -1.362139
H  -0.631487 0.774756 -0.535969
H  3.65045 -1.182575 0.453127
H  3.404111 0.361179 1.300752
H  -1.703348 -0.374483 1.41796
H  -1.446185 -1.964735 0.645707
H  4.726418 -0.014162 -1.4635
H  4.427609 1.570092 -0.695514
H  -3.157499 -1.33623 -1.024469
H  5.922691 0.695401 1.183489
H  6.755105 0.499299 -0.282117
H  -5.580879 0.881497 -0.449342
