program: Gaussian 09
title: 000149326
version: EM64L-G09RevD.01
frameworkgroup: C1[X(C7H10N4O4)]
method: RPBEPBE
basis: SDD
operation: Freq
keyword: #p
keyword: freq=noraman
keyword: PBEPBE/SDD
title: #p freq=noraman PBEPBE/SDD
converged: NO YES NO YES
title: Mulliken charges:
elementType: O O O O N N N N C C C C C C C H H H H H H H H H H
charge: -0.265874 -0.210977 -0.234937 -0.278891 -0.179665 -0.059969 0.036898 -0.612445 0.156679 0.204649 0.152769 -0.335531 -0.628838 -0.760660 0.290618 0.254799 0.254791 0.235983 0.271322 0.271260 0.248466 0.248518 0.245658 0.349331 0.346044
chargesum: 0.00000
title: Mulliken charges with hydrogens summed into heavy atoms:
elementType: O O O O N N N N C C C C C C C
charge: -0.265874 -0.210977 -0.234937 -0.278891 -0.179665 -0.059969 0.036898 0.082930 0.156679 0.204649 0.152769 0.174059 0.149727 -0.018018 0.290618
polarizability: 1.74582074e+02 -3.54235949e+00 1.38612031e+02 2.92482364e-03 3.34527583e-03 6.08063531e+01
1716.lowfreq: -11.4161 -8.5835 -5.4183 -4.3952 0.0006 0.0006 0.0008 17.9212 55.4125
frequency: -8.4734 17.8687 55.4005 74.1869 95.0791 126.1234 132.8332 143.8783 169.1625 194.5200 205.5280 245.7972 251.4050 307.1118 324.8938 376.9097 436.9417 472.7041 510.5569 537.5294 571.1016 599.6141 614.7320 615.8114 663.8094 693.2226 701.2351 701.9782 747.9982 846.8935 876.9452 973.8729 991.1194 1040.8228 1051.6481 1063.2492 1068.1735 1113.0745 1121.6655 1143.3482 1213.8552 1259.8185 1290.3155 1300.4331 1329.4734 1342.4098 1369.7922 1403.0805 1414.4098 1452.0250 1452.9082 1460.5897 1463.1351 1470.5555 1477.3876 1500.0937 1527.2391 1590.1810 1694.4614 2969.0561 2996.9594 3015.2317 3025.6599 3072.7953 3121.9329 3125.4556 3132.4369 3556.8051 3714.8488
redmass: 7.8931 5.0133 6.4292 5.8907 4.3042 1.0759 1.3613 2.2399 2.5352 6.3235 8.6650 5.2552 4.0841 3.1588 4.2633 6.0602 6.4788 3.6250 1.0939 1.1293 5.1750 5.4580 6.1397 5.0260 5.6530 4.6492 11.4099 8.7582 11.5435 5.2814 4.3914 2.2953 1.7598 1.5152 6.0566 2.1231 2.6015 2.9298 1.3217 4.4718 1.0640 5.5187 4.2491 3.0741 10.0866 3.9677 3.2979 1.2363 2.2123 1.0449 1.9113 1.1214 1.0399 1.0923 1.3683 2.0583 9.0533 1.2048 7.8273 1.0566 1.0375 1.1034 1.0331 1.0959 1.1003 1.1023 1.1027 1.0449 1.1058
irintensity: 4.0066 0.3004 1.0323 3.3450 8.6421 0.1432 0.2620 8.2350 8.0382 5.8040 12.4583 3.4768 1.5126 3.9401 0.1266 0.2917 3.6825 2.0889 143.9747 187.3762 4.0898 1.4232 4.3702 1.7281 0.0412 0.1272 38.7132 2.1260 18.2476 41.6924 12.1038 32.6477 0.0643 4.9174 115.8274 28.0665 47.0496 10.7723 0.7390 132.9164 0.1709 215.3752 101.6172 321.2152 260.1791 151.1007 39.0509 20.6592 75.1685 14.6674 60.2548 0.6500 14.2334 11.3797 17.8308 15.9693 72.9399 109.4692 360.0559 20.5677 5.1940 12.7956 18.0317 7.8912 11.6182 6.3786 10.2111 77.6470 62.0254
temp: 298.150 k
press: 1.00000 atm
elementType: 8 8 8 8 7 7 7 7 6 6 6 6 6 6 6 1 1 1 1 1 1 1 1 1 1
symmnumber: 1
zpe: 482227.2 jmol-1
zpe.correction: 0.183671 hartree
zpe.thermalcorrener: 0.198287 hartree
zpe.thermalcorrenthalpy: 0.199231 hartree
zpe.thermalcorrgfe: 0.140491 hartree
zpe.sumelectzpe: -791.436899 hartree
zpe.sumelectthermal: -791.422283 hartree
zpe.sumelectthermalent: -791.421339 hartree
zpe.sumelectthermalfe: -791.480079 hartree
dipole: -4.2806 0.6982 0.0012
dipole: 4.3371
quadrupole: -101.0240 -81.6026 -85.5545
quadrupole: -9.5066 -0.0053 0.0013
quadrupole: -11.6303 7.7911 3.8392 -9.5066 -0.0053 0.0013
hfenergy: -791.6205696 hartree
pointgroup: C01 [X(C7H10N4O4)]
dipole: -1.685373 -0.2668264 -0.0006687 debye
dipolederiv: -1.8250966 -0.1051444 -0.0001615 0.0681652 -0.4111152 -0.000082 -0.0000689 -0.0001024 -0.2765443 -0.8937193 0.1546775 0.0000794 0.3490508 -0.5502676 -0.0001232 -0.0001253 0.0000992 -0.2312315 -0.6072075 -0.1417454 -0.0000145 -0.3015577 -0.9060743 -0.0000187 -0.0001298 -0.0003264 -0.2459904 -0.8455504 0.1185096 0.0000369 0.2128224 -1.0145907 -0.0003622 0.0000661 -0.0003526 -0.3541579 -0.0705467 -0.0322362 0.0000668 -0.0763423 -0.7420208 -0.000011 -0.000026 -0.000153 -0.0706609 -0.7949691 0.2413856 -0.0000113 0.4742969 -0.5344109 0.0000098 0.0000042 -0.0000182 -0.2450785 1.91604 0.2516596 -0.0000092 0.1749959 1.2800917 0.0001801 0.0001645 0.0002067 0.2094171 -0.9049289 -0.4679176 -0.0002669 -0.5781281 -0.8477061 -0.0001111 -0.0003333 -0.0001156 -0.7305536 0.4794577 0.1101706 -0.0000103 -0.4757903 0.5180122 -0.0000186 -0.0001273 0.0000655 0.022335 -0.9801877 -0.4702565 -0.0001507 -0.5836217 -0.1113951 -0.0000588 0.0000533 -0.000016 0.0188867 0.6574748 -0.2268178 -0.0000073 0.2583492 0.5480608 0.0001259 0.0001079 0.0003002 0.0358029 0.7135307 0.143811 0.000103 0.5550663 0.2705698 0.0000016 0.0004782 -0.0000171 0.3701785 0.1687315 -0.0244043 -0.0000731 -0.0109877 0.3760166 -0.0000927 -0.0001658 -0.0000908 0.1756392 0.027915 0.2577342 0.0000125 0.0952443 -0.1431859 -0.0000578 -0.0001651 -0.0004757 0.027908 2.4444365 0.2723139 0.0002814 0.0140197 1.6479071 0.000734 0.0001177 0.0007441 0.3414105 -0.0579671 -0.0061496 0.0034303 -0.0947046 -0.0030336 -0.0684781 -0.0145198 -0.083113 -0.0252958 -0.0579307 -0.0061923 -0.003414 -0.0946973 -0.0031874 0.0684932 0.0143837 0.0831453 -0.0251794 -0.0932279 0.1171853 0.0002053 0.0346459 0.0669225 0.000019 0.000163 -0.0000036 0.1129712 0.0790003 -0.0567366 -0.070291 0.0102904 0.03221 -0.0063959 -0.0517201 -0.0398163 -0.0113189 0.079081 -0.0565895 0.0701549 0.0102732 0.0319899 0.0064909 0.051677 0.04004 -0.011607 0.0354426 0.0097398 0.0903251 -0.0195864 0.0526903 0.0162317 0.0802549 -0.0225646 -0.012104 0.0351242 0.0096456 -0.0904802 -0.0197833 0.0528262 -0.0163943 -0.080268 0.022516 -0.0116209 0.0245813 -0.1462182 0.0001936 -0.0574862 -0.0134424 0.0001368 0.0001614 0.000258 0.1198146 0.2223036 0.006856 -0.0000133 0.0608256 0.2198903 -0.0000967 0.0000259 -0.0000942 0.4107682 0.2482127 0.0467198 0.0000141 -0.00536 0.1832425 -0.0001217 -0.0000085 -0.0001154 0.4062111 unknown
polarizability: 174.6143578|3.3743144|138.5797423|0.0063989|0.0183844|60.8063575 unknown
InChI: InChI=1S/C7H10N4O4/c1-4-6(11(13)14)10(2)5(9-4)3-15-7(8)12/h3,8H2,1-2H3
charge 0 multiplicity 1
25 atoms
O  -2.675189 -0.403478 -0.000494
O  4.165133 -0.599955 0.000162
O  3.568977 1.614267 0.000502
O  -4.359966 1.249408 0.000311
N  0.819518 0.862531 0.000213
N  -0.034664 -1.251485 -0.000023
N  3.272951 0.34361 -0.000011
N  -4.848012 -1.054662 -0.000986
C  -0.324881 0.076695 0.000103
C  1.902987 -0.046657 0.000113
C  1.353246 -1.350852 -0.000007
C  -1.699738 0.688114 0.00018
C  0.86382 2.339969 0.000453
C  2.046298 -2.676325 -0.000141
C  -4.020075 0.040118 -0.000325
H  -1.859116 1.328528 0.890836
H  -1.85884 1.329388 -0.889902
H  -0.167484 2.724276 0.001333
H  1.395625 2.710126 0.889669
H  1.394254 2.710498 -0.889445
H  2.701873 -2.787676 -0.882174
H  2.70391 -2.786811 0.880453
H  1.289359 -3.475699 0.001015
H  -4.456114 -1.993744 -0.001462
H  -5.85317 -0.908085 -0.000973
