program: Gaussian 09
title: 000149327
version: EM64L-G09RevD.01
frameworkgroup: C1[X(C11H10FN3O2)]
method: RPBEPBE
basis: SDD
operation: Freq
keyword: #p
keyword: freq=noraman
keyword: PBEPBE/SDD
title: #p freq=noraman PBEPBE/SDD
converged: YES YES NO NO
title: Mulliken charges:
elementType: F O O N N N C C C C C C C C C C C H H H H H H H H H H
charge: -0.197474 -0.209905 -0.230886 -0.164701 -0.068758 0.036734 0.033618 0.203045 0.153857 0.318410 -0.610933 -0.759985 -0.335106 -0.335016 -0.352469 -0.352487 0.326067 0.239127 0.264474 0.264405 0.245782 0.248320 0.248364 0.253611 0.253567 0.264169 0.264170
chargesum: 0.00000
title: Mulliken charges with hydrogens summed into heavy atoms:
elementType: F O O N N N C C C C C C C C C C C
charge: -0.197474 -0.209905 -0.230886 -0.164701 -0.068758 0.036734 0.033618 0.203045 0.153857 0.318410 0.157073 -0.017519 -0.081495 -0.081449 -0.088299 -0.088317 0.326067
polarizability: 2.22303363e+02 1.61089782e+00 1.27402615e+02 2.05171762e-03 -4.44922051e-02 1.06519457e+02
1716.lowfreq: -50.7601 -7.3078 0.0006 0.0009 0.0009 5.3207 7.5875 46.9654 53.2109
frequency: -50.7423 46.9252 53.2099 57.0280 119.4640 135.2878 160.5703 167.3767 210.1770 214.8726 242.8999 259.3775 301.6211 348.3612 358.3830 402.9797 406.8606 423.5806 445.3508 511.4720 574.4660 598.4295 616.8744 624.1426 629.4056 704.6778 731.2655 734.3223 747.6246 777.3058 818.9092 823.3342 840.7338 951.9809 965.1959 972.5294 1005.1509 1040.2192 1041.3897 1069.9341 1101.9864 1116.9206 1124.3055 1157.2430 1185.0959 1202.5372 1262.2439 1287.0063 1291.7534 1331.9278 1338.0230 1359.9761 1389.6464 1400.1057 1403.6069 1435.6374 1452.5283 1460.6477 1461.8796 1462.5791 1480.0049 1515.4772 1530.6664 1593.5929 1616.4196 2997.0993 3023.5777 3073.1916 3121.0446 3123.2721 3134.3693 3151.5178 3152.6947 3179.9229 3182.7116
redmass: 3.9866 7.9588 8.6970 6.4119 3.6177 1.0466 1.0434 8.6159 5.1241 4.4912 7.5993 4.9957 3.6000 4.4089 7.0448 7.4001 2.9490 5.4438 7.8563 3.0583 6.0159 4.4984 7.2669 4.3569 6.6505 8.4593 4.1625 10.0176 8.7505 6.7304 5.7364 1.2418 1.6479 1.3694 1.3600 2.0439 3.2466 1.5140 3.8099 2.1022 1.3216 4.2634 1.3194 1.4745 3.7548 2.3610 7.7283 5.7206 1.2569 10.9342 5.4202 6.3651 4.6780 3.6798 1.2345 2.7131 1.0448 1.2353 1.0419 1.2305 1.1444 5.9014 5.8957 7.8144 6.6268 1.0374 1.0329 1.0959 1.1004 1.1023 1.1030 1.0903 1.0901 1.0962 1.0972
irintensity: 0.0011 1.2515 0.8054 1.6577 5.0630 0.3484 0.0037 0.2230 0.5095 4.7883 2.5631 4.1052 5.9419 1.1482 3.7331 0.1403 0.0025 0.1597 2.8073 20.0059 9.4383 6.1309 1.2831 1.9680 1.6515 2.8848 4.9027 0.2174 6.2320 18.6350 1.8643 0.0135 83.8056 0.3589 0.0250 11.8956 23.7259 4.3045 0.7023 4.1991 10.8549 80.1682 0.2765 96.2002 64.6967 34.5343 77.3019 16.4025 1.9277 222.8202 115.1952 0.0006 196.0781 3.5874 29.8550 86.1452 14.2449 33.4630 9.4038 42.2068 31.6549 43.4396 28.4331 5.5160 47.5906 5.8709 14.3515 7.4434 11.7497 6.1235 5.7285 3.7938 3.9986 1.7567 1.7957
temp: 298.150 k
press: 1.00000 atm
elementType: 9 8 8 7 7 7 6 6 6 6 6 6 6 6 6 6 6 1 1 1 1 1 1 1 1 1 1
symmnumber: 1
zpe: 515799.3 jmol-1
zpe.correction: 0.196458 hartree
zpe.thermalcorrener: 0.210950 hartree
zpe.thermalcorrenthalpy: 0.211895 hartree
zpe.thermalcorrgfe: 0.154266 hartree
zpe.sumelectzpe: -838.411443 hartree
zpe.sumelectthermal: -838.396950 hartree
zpe.sumelectthermalent: -838.396006 hartree
zpe.sumelectthermalfe: -838.453634 hartree
dipole: -3.1179 -0.6164 -0.0001
dipole: 3.1783
quadrupole: -126.9856 -101.6975 -87.5225
quadrupole: 9.9620 0.0107 -0.0231
quadrupole: -21.5837 3.7044 17.8794 9.9620 0.0107 -0.0231
hfenergy: -838.6079007 hartree
pointgroup: C01 [X(C11H10F1N3O2)]
dipole: 1.2237499 0.2569001 -0.0000308 debye
polarizability: 222.2523809|2.7259266|127.4535976|-0.0025746|0.044465|106.5194567 unknown
InChI: InChI=1S/C11H10FN3O2/c1-7-11(15(16)17)14(2)10(13-7)8-3-5-9(12)6-4-8/h3-6H,1-2H3
charge 0 multiplicity 1
27 atoms
F  5.512748 0.26505 0.000258
O  -4.657573 0.088554 -0.000263
O  -3.52332 2.080647 -0.001408
N  -1.051666 0.653939 -0.000406
N  -0.766705 -1.608574 0.000664
N  -3.55683 0.777587 -0.000379
C  -0.13892 -0.396631 0.000134
C  -2.328185 0.052185 -0.000144
C  -2.132599 -1.350947 0.000488
C  1.334079 -0.202777 0.00014
C  -0.712388 2.091965 -0.001194
C  -3.143307 -2.453653 0.00099
C  2.046554 -0.130282 -1.224762
C  2.045949 -0.125433 1.225106
C  3.449055 0.027626 -1.234708
C  3.448444 0.032501 1.23513
C  4.115569 0.107579 0.000221
H  0.384776 2.177875 -0.001835
H  -1.129548 2.587218 -0.890897
H  -1.128529 2.587988 0.888572
H  -2.618032 -3.42131 0.000358
H  -3.805754 -2.392101 0.882758
H  -3.807242 -2.391576 -0.879594
H  1.50457 -0.209722 -2.172671
H  1.503501 -0.201127 2.17306
H  4.015011 0.081336 -2.168679
H  4.013941 0.089884 2.16916
