program: Gaussian 09
title: 000149378
version: EM64L-G09RevD.01
frameworkgroup: C1[X(C19H20N8)]
method: RPBEPBE
basis: SDD
operation: Freq
keyword: #pfreq=noraman
keyword: PBEPBE/SDD
title: #p freq=noraman PBEPBE/SDD
converged: YES YES NO NO
title: Mulliken charges:
elementType: N N N N N N N N C C C C C C C C C C C C C C C C C C C H H H H H H H H H H H H H H H H H H H H
charge: -0.460521 -0.460599 -0.052309 -0.052352 -0.657840 -0.657959 -0.384218 -0.384533 -0.389654 -0.510603 -0.510953 0.172719 0.173124 0.319923 0.319775 -0.004025 -0.003735 -0.533805 -0.533831 -0.370732 -0.371158 0.400086 0.400115 -0.377525 -0.376769 0.055996 0.056326 0.191977 0.263839 0.213571 0.255238 0.213270 0.255088 0.307649 0.307703 0.289593 0.289830 0.248524 0.248513 0.216484 0.215864 0.312045 0.316553 0.312082 0.316485 0.210346 0.210404
chargesum: 0.00000
title: Mulliken charges with hydrogens summed into heavy atoms:
elementType: N N N N N N N N C C C C C C C C C C C C C C C C C C C
charge: -0.152872 -0.152896 -0.052309 -0.052352 -0.029243 -0.029392 -0.173872 -0.174129 0.066162 -0.041794 -0.042595 0.172719 0.173124 0.319923 0.319775 -0.004025 -0.003735 -0.244212 -0.244001 -0.122208 -0.122645 0.400086 0.400115 -0.161041 -0.160905 0.055996 0.056326
polarizability: 3.81792938e+02 3.72265426e-01 2.49951037e+02 -3.29362340e-01 -3.37744446e+01 2.21678225e+02
1716.lowfreq: -0.0008 -0.0006 0.0010 2.3967 3.4002 5.6850 10.9468 13.1567 16.7337
frequency: 10.9360 12.8234 16.2805 39.8225 47.5298 59.4299 64.4287 87.3615 90.8923 123.7513 161.6241 166.8674 174.7189 202.2188 230.9756 270.8046 272.4501 272.9443 291.3523 328.1374 345.9663 350.7544 392.3847 426.5400 427.6010 433.8627 434.7390 438.4211 441.4021 442.8243 461.6728 512.4946 515.6359 526.8085 538.0681 579.9090 581.5234 588.2188 596.7902 599.6707 606.9354 665.2666 674.6361 700.9011 701.1908 725.1418 725.8672 734.4222 735.6672 751.6001 779.5139 779.6951 807.6310 807.8801 816.5229 833.8907 834.2266 842.8774 844.4205 922.5855 923.1903 928.4831 931.2624 955.7972 956.0695 965.9837 970.3695 1021.4313 1034.3585 1035.9454 1040.8059 1041.2998 1071.9100 1072.7094 1098.4472 1099.7960 1109.6931 1132.6198 1132.6713 1206.8338 1209.7797 1214.7201 1218.3320 1248.0817 1248.3239 1265.7714 1267.7337 1277.2916 1289.9153 1296.0691 1323.0334 1344.7366 1357.8708 1359.9814 1375.6642 1377.9276 1394.1244 1394.6013 1451.8641 1452.0800 1454.4610 1455.5140 1477.0029 1493.9967 1494.8296 1522.9707 1527.0235 1578.2326 1578.5201 1600.3897 1600.8401 1633.2258 1633.4166 1643.2614 1643.3989 2977.2467 2977.6166 2981.8365 3048.4064 3068.3629 3082.1468 3131.5652 3131.7717 3160.6415 3160.7337 3168.7782 3168.8072 3325.7052 3326.0433 3537.4109 3537.5868 3596.1118 3596.5860 3682.4417 3682.5205
redmass: 5.1617 6.0505 5.0274 5.3203 5.4679 4.7137 4.9278 2.1908 3.8492 5.7630 4.4782 6.1615 3.9302 4.4889 4.0406 4.4349 3.6115 3.7985 3.6882 5.0292 4.9225 4.9457 3.6078 1.1392 1.1393 2.3205 1.5894 2.0334 1.9933 2.1288 3.9158 3.9463 3.9549 3.6486 3.3561 3.3982 3.5234 1.9275 1.6995 1.7847 2.2427 5.8207 5.5539 3.3086 3.2735 5.9307 3.9647 1.2654 5.8102 5.3060 3.4938 3.5055 1.4493 1.4398 2.3133 1.5828 1.5887 4.4512 2.1875 1.5085 1.5080 3.8545 3.7856 1.3796 1.3798 7.2693 4.5870 6.1034 1.9790 2.9423 1.6809 1.6624 1.7045 1.7055 1.5947 1.5956 1.2969 1.6266 1.6267 1.8009 2.1059 1.9046 1.4977 1.3962 1.4331 4.0256 4.5918 1.5919 1.4486 1.2227 1.3808 1.4272 3.1327 3.3545 4.1889 3.8580 3.3531 3.3329 4.5421 4.0551 1.1295 1.1368 1.1106 4.6120 4.3164 4.7801 4.8891 5.9529 5.9453 3.6798 3.7176 1.4559 1.4488 6.2133 6.2771 1.0647 1.0642 1.0665 1.0926 1.0962 1.1003 1.0881 1.0881 1.0930 1.0930 1.0958 1.0958 1.0760 1.0760 1.0450 1.0450 1.0812 1.0812 1.1035 1.1035
irintensity: 0.1967 0.3306 0.3436 1.3341 3.4835 11.9353 12.0006 0.2601 0.8302 1.2963 13.1116 0.6762 5.7260 2.1554 0.0426 7.8190 1.8442 17.5214 0.1838 0.0007 7.1437 6.8037 20.7172 66.5171 98.2369 88.8759 132.0144 112.5984 15.3717 39.2454 14.0264 6.7589 18.9345 38.9675 19.8765 5.6173 7.3677 20.6315 86.4584 58.0225 43.4761 0.1074 3.8534 22.1321 1.5930 7.1738 3.4814 1.2458 0.3069 3.4107 8.3556 2.9590 68.7077 31.6903 12.8129 66.3821 75.0054 7.2522 2.1353 42.1801 39.1397 8.3165 6.8621 0.2757 0.2726 0.5090 2.2414 4.9166 7.2670 4.2052 0.8841 6.0418 40.0061 126.0915 38.4738 95.2135 4.3108 0.9343 0.7314 18.7610 12.5940 1.3979 7.1774 16.0259 17.1262 65.4615 16.9875 0.0036 10.9583 0.7647 17.1454 1.3581 77.4030 89.0993 18.8502 119.0193 102.2426 99.9964 56.0633 14.8821 8.3316 1.8336 16.5076 3.2394 12.6540 181.5833 35.3219 17.4736 104.1754 70.3595 78.9453 105.2253 267.9584 0.3928 9.3235 18.1053 21.3035 48.0623 5.0010 0.1781 28.1727 16.4950 14.7519 2.4294 2.1011 6.2898 15.4174 31.5648 31.1792 18.9872 19.8118 17.8480 49.5799 19.3988 19.3399
temp: 298.150 k
press: 1.00000 atm
elementType: 7 7 7 7 7 7 7 7 6 6 6 6 6 6 6 6 6 6 6 6 6 6 6 6 6 6 6 1 1 1 1 1 1 1 1 1 1 1 1 1 1 1 1 1 1 1 1
symmnumber: 1
zpe: 978715.7 jmol-1
zpe.correction: 0.372773 hartree
zpe.thermalcorrener: 0.396648 hartree
zpe.thermalcorrenthalpy: 0.397592 hartree
zpe.thermalcorrgfe: 0.315182 hartree
zpe.sumelectzpe: -1172.157934 hartree
zpe.sumelectthermal: -1172.134059 hartree
zpe.sumelectthermalent: -1172.133115 hartree
zpe.sumelectthermalfe: -1172.215526 hartree
dipole: 0.0201 3.8386 0.5864
dipole: 3.8832
quadrupole: -127.4867 -154.7268 -148.2786
quadrupole: 0.0453 -0.1197 16.1672
quadrupole: 16.0107 -11.2295 -4.7813 0.0453 -0.1197 16.1672
hfenergy: -1172.5307072 hartree
pointgroup: C01[X(C19H20N8)]
dipole: 0.0094441 1.5097918 0.2333821 debye
polarizability: 381.7941276|0.2512641|250.0688005|-0.2305582|-33.7240266|221.5592725 unknown
InChI: InChI=1S/C19H20N8/c20-18(21)10-4-6-12-14(8-10)26-16(24-12)2-1-3-17-25-13-7-5-11(19(22)23)9-15(13)27-17/h4-9,20,22,26-27H,1-3,21,23H2
charge 0 multiplicity 1
47 atoms
N  -3.059826 -0.546102 -1.164448
N  3.068539 -0.561815 -1.166754
N  -3.312555 -2.021225 0.558044
N  3.29647 -2.019122 0.57428
N  -7.992903 2.486567 1.047681
N  7.998742 2.467505 1.05918
N  -7.251163 2.697113 -1.24576
N  7.272419 2.66347 -1.240242
C  -0.001464 -1.583578 -0.509798
C  -1.284717 -2.362118 -0.914284
C  1.280626 -2.364687 -0.913181
C  -2.550591 -1.672683 -0.495198
C  2.546858 -1.678291 -0.490274
C  -4.22867 -0.142076 -0.499246
C  4.232647 -0.156238 -0.494184
C  -4.369023 -1.082172 0.5809
C  4.357377 -1.085124 0.597544
C  -5.139518 0.901465 -0.721347
C  5.150946 0.880197 -0.718603
C  -5.469494 -0.971744 1.45811
C  5.449776 -0.970603 1.484265
C  -6.231434 1.011136 0.172604
C  6.234599 0.994308 0.184855
C  -6.388944 0.073474 1.243589
C  6.376669 0.067542 1.267371
C  -7.204864 2.130991 -0.053243
C  7.215526 2.107111 -0.043567
H  0.00013 -0.579198 -0.97924
H  -0.001637 -1.425914 0.583818
H  -1.283706 -2.535355 -2.009825
H  -1.27786 -3.351082 -0.424547
H  1.281324 -2.536033 -2.008981
H  1.270098 -3.354414 -0.425011
H  -2.660373 -0.111752 -1.994324
H  2.680235 -0.135133 -2.00587
H  -5.066755 1.62144 -1.54176
H  5.0900 1.591736 -1.547303
H  -5.601395 -1.691972 2.270694
H  5.57003 -1.682431 2.305995
H  -7.272104 0.129543 1.890004
H  7.253613 0.125569 1.922032
H  -8.706309 3.205911 0.952958
H  -7.796528 2.129376 1.979591
H  8.7162 3.1826 0.962897
H  7.79613 2.118017 1.99266
H  -7.92463 3.488922 -1.301521
H  7.950808 3.450871 -1.298161
