program: Gaussian 09
title: 000149333
version: EM64L-G09RevD.01
frameworkgroup: C1[X(C12H19N3O4)]
method: RPBEPBE
basis: SDD
operation: Freq
keyword: #p
keyword: freq=noraman
keyword: PBEPBE/SDD
title: #p freq=noraman PBEPBE/SDD
converged: YES YES NO NO
title: Mulliken charges:
elementType: O O O O N N N C C C C C C C C C C C C H H H H H H H H H H H H H H H H H H H
charge: -0.279167 -0.229602 -0.221999 -0.229544 -0.173954 -0.088729 0.037903 0.148401 -0.520124 0.178953 -0.699584 -0.693391 -0.706912 0.241527 -0.258348 0.174577 0.212800 -0.623532 -0.780971 0.244622 0.236221 0.217587 0.212230 0.242108 0.229156 0.202920 0.223927 0.249251 0.209880 0.212712 0.234151 0.259774 0.267447 0.268522 0.236374 0.242730 0.242784 0.279300
chargesum: 0.00000
title: Mulliken charges with hydrogens summed into heavy atoms:
elementType: O O O O N N N C C C C C C C C C C C C
charge: -0.279167 -0.229602 -0.221999 -0.229544 -0.173954 -0.088729 0.037903 0.148401 -0.039280 0.178953 -0.027660 -0.037388 -0.035069 0.241527 0.235577 0.174577 0.212800 0.148811 -0.016157
polarizability: 1.75902196e+02 -2.76492648e+00 1.89411919e+02 1.99035558e+01 5.30206489e+00 1.39821216e+02
1716.lowfreq: -8.7405 -5.8118 0.0001 0.0003 0.0005 1.8977 14.2690 17.8107 27.7557
frequency: 13.9949 17.6807 27.7542 39.8400 60.4143 80.3153 99.6413 109.6464 137.8898 150.9594 166.3602 185.5274 186.6857 221.3855 241.1022 247.1990 264.8278 267.9164 275.1368 290.6946 305.1573 320.1368 340.0000 344.9072 365.9734 381.9871 408.2236 448.0824 486.0294 562.1210 567.6842 585.4156 633.8338 649.3833 683.6342 718.6929 725.9763 746.7175 770.6328 811.9716 836.6861 883.9678 931.6742 939.3430 953.8615 956.5666 961.0527 993.9548 1025.3245 1026.8957 1045.3985 1054.8084 1073.7761 1101.0061 1114.1333 1122.0972 1162.6846 1184.7237 1206.2484 1222.3391 1233.0545 1265.7886 1267.3057 1304.3826 1322.4251 1332.8670 1351.8840 1367.1741 1370.3431 1377.1280 1396.3193 1401.7554 1403.1477 1436.5378 1443.7348 1452.4972 1457.9131 1465.1408 1468.0371 1470.8477 1475.3414 1476.4006 1476.9259 1479.0928 1482.9533 1495.3672 1499.9001 1519.0086 1624.3215 2978.0493 2981.3872 2986.4808 2989.6848 3014.5811 3022.6487 3024.3500 3062.6261 3071.2432 3076.1808 3082.6902 3087.8759 3092.5731 3096.6473 3096.9276 3098.9825 3122.7478 3123.8250 3133.3592
redmass: 3.7784 5.2282 4.4699 5.5306 8.9758 3.6087 5.2862 4.3340 1.0610 1.7291 1.5105 1.9112 1.3305 4.1287 1.4637 5.4084 2.9319 1.1240 1.8361 2.2423 3.7094 2.7465 3.2735 2.7999 2.3389 4.8316 6.5490 4.3697 3.5671 3.3921 3.4172 4.1917 5.3745 5.3625 7.5415 6.9270 6.0706 10.2194 4.5933 3.1896 3.7975 3.1649 1.7267 1.6061 1.2122 2.4730 2.2734 1.8203 1.4075 1.4853 1.5030 2.8547 2.6235 4.3759 3.2745 1.3235 3.1123 1.3281 2.8602 1.4246 2.7323 3.4431 4.4389 3.1917 3.0115 3.5163 1.4714 2.4605 1.1799 1.2022 1.4530 1.2273 2.2566 1.1299 1.4097 1.0494 1.0439 1.0515 1.3608 1.0461 1.0538 1.0610 1.0501 1.0862 1.3749 1.9797 1.0701 7.5851 10.7162 1.0346 1.0349 1.0394 1.0356 1.0586 1.0599 1.0333 1.0979 1.1004 1.0997 1.1038 1.0998 1.1008 1.1035 1.1003 1.0998 1.1022 1.0968 1.1023
irintensity: 0.3404 0.0667 0.7402 0.4529 0.0479 5.4007 2.7893 2.2816 0.0878 1.4457 2.1067 0.9325 1.1558 2.7036 2.6439 1.8548 3.2451 0.1592 3.6691 1.8351 5.5145 4.5296 8.0887 1.3385 0.3106 0.6864 0.7383 4.6358 4.0950 1.4312 0.7909 2.9368 5.5164 3.2570 1.0646 3.5856 1.3584 8.1064 6.7304 9.9954 3.6602 5.0480 2.8587 7.5830 0.3185 1.9933 4.7415 5.1136 0.3288 28.4731 3.0577 34.9649 10.4883 446.7472 58.0706 0.7501 87.3982 7.8780 5.5559 20.8081 14.1078 31.6663 49.9206 54.6563 138.7545 54.3007 34.8078 82.6882 17.2725 19.0248 13.0738 25.4276 100.0537 16.4995 46.3242 0.0264 30.8242 0.1829 4.0106 2.6222 8.9743 4.6676 3.2646 33.3287 18.1387 43.5182 36.4420 70.0833 189.1434 27.9430 21.4725 14.4546 30.4608 5.2934 25.8926 16.6457 12.6194 16.6299 25.0306 3.6619 43.4305 3.2895 8.5997 45.4929 42.1163 7.3910 3.4282 8.5168
temp: 298.150 k
press: 1.00000 atm
elementType: 8 8 8 8 7 7 7 6 6 6 6 6 6 6 6 6 6 6 6 1 1 1 1 1 1 1 1 1 1 1 1 1 1 1 1 1 1 1
symmnumber: 1
zpe: 801489.2 jmol-1
zpe.correction: 0.305271 hartree
zpe.thermalcorrener: 0.326423 hartree
zpe.thermalcorrenthalpy: 0.327367 hartree
zpe.thermalcorrgfe: 0.252686 hartree
zpe.sumelectzpe: -932.283526 hartree
zpe.sumelectthermal: -932.262374 hartree
zpe.sumelectthermalent: -932.261430 hartree
zpe.sumelectthermalfe: -932.336112 hartree
dipole: -2.2872 6.4169 0.3516
dipole: 6.8214
quadrupole: -108.0958 -118.5220 -112.4895
quadrupole: -10.3467 2.0439 -11.6583
quadrupole: 4.9400 -5.4862 0.5462 -10.3467 2.0439 -11.6583
hfenergy: -932.5887973 hartree
pointgroup: C01 [X(C12H19N3O4)]
dipole: 0.7624161 -2.5668654 0.1799379 debye
polarizability: 175.0144643|-2.5034525|189.4793193|-20.655513|-5.1909315|140.6415468 unknown
InChI: InChI=1S/C12H19N3O4/c1-8-13-9(10(14(8)5)15(17)18)6-7-19-11(16)12(2,3)4/h6-7H2,1-5H3
charge 0 multiplicity 1
38 atoms
O  -1.702873 0.524642 0.629924
O  -3.056211 1.993245 -0.557671
O  2.048887 2.586076 -0.160858
O  3.521294 1.440395 -1.491386
N  2.618336 -1.016061 -0.368594
N  1.102449 -1.295455 1.306467
N  2.588274 1.479871 -0.581919
C  -3.671477 -0.426664 -0.415082
C  0.360641 1.067776 1.787645
C  1.186147 0.062876 1.035102
C  -4.224073 -0.934422 0.950104
C  -4.836912 -0.055346 -1.361364
C  -2.778897 -1.528773 -1.055328
C  -2.819831 0.830291 -0.155839
C  -0.796383 1.657064 0.96508
C  2.12925 0.260469 -0.004841
C  1.964038 -1.92307 0.453544
C  3.610642 -1.35423 -1.408094
C  2.170762 -3.404157 0.416113
H  -0.044654 0.564989 2.682023
H  0.993529 1.915731 2.107178
H  -4.85268 -0.166277 1.436846
H  -4.848932 -1.831138 0.782214
H  -3.400654 -1.200646 1.634288
H  -5.467162 0.73852 -0.924913
H  -5.46525 -0.946377 -1.543335
H  -4.461661 0.315042 -2.331381
H  -1.941485 -1.793199 -0.387606
H  -3.388268 -2.43298 -1.239681
H  -2.364369 -1.192756 -2.023895
H  -1.359868 2.403491 1.553324
H  -0.446421 2.137692 0.03604
H  3.283996 -0.981777 -2.390733
H  4.584918 -0.89634 -1.17985
H  3.712754 -2.449554 -1.442322
H  1.902858 -3.840072 -0.564211
H  3.21649 -3.687259 0.637319
H  1.521097 -3.853216 1.182092
