program: Gaussian 09
title: 000149331
version: EM64L-G09RevD.01
frameworkgroup: C1[X(C12H12FN3O3)]
method: RPBEPBE
basis: SDD
operation: Freq
keyword: #p
keyword: freq=noraman
keyword: PBEPBE/SDD
title: #p freq=noraman PBEPBE/SDD
converged: YES YES NO NO
title: Mulliken charges:
elementType: F O O O N N N C C C C C C C C C C C C H H H H H H H H H H H H
charge: -0.192224 -0.455040 -0.206243 -0.226849 -0.184729 -0.206682 0.037224 0.227466 0.130271 0.162801 -0.492534 0.307028 -0.635111 -0.334368 -0.298759 -0.332974 -0.388931 -0.370134 0.338195 0.253082 0.247083 0.250129 0.260448 0.274998 0.218901 0.182541 0.257294 0.272639 0.265174 0.266858 0.372444
chargesum: 0.00000
title: Mulliken charges with hydrogens summed into heavy atoms:
elementType: F O O O N N N C C C C C C C C C C C C
charge: -0.192224 -0.082596 -0.206243 -0.226849 -0.184729 -0.206682 0.037224 0.227466 0.130271 0.162801 0.007631 0.307028 0.150464 0.067075 -0.041464 -0.060334 -0.123758 -0.103276 0.338195
polarizability: 2.76216699e+02 1.17052100e+01 1.80980783e+02 2.41177185e+00 -1.34582156e+01 8.69167123e+01
1716.lowfreq: -4.5289 -2.7670 -1.0076 -0.0006 0.0004 0.0008 33.4789 44.7624 46.8082
frequency: 33.4066 44.7615 46.7992 56.2293 67.7819 117.6041 130.6424 162.0225 184.7721 194.1289 207.0931 243.1179 254.5143 290.6994 296.6861 348.6904 365.8706 398.3680 416.4069 418.9588 439.3456 453.5783 516.3567 571.3155 610.4050 618.4642 632.0539 666.5453 675.5746 708.2349 710.9093 740.6865 753.4546 772.3533 812.1596 822.2917 843.9458 847.6460 932.6978 953.9644 970.6798 1001.8989 1004.5512 1041.6397 1045.7525 1058.0789 1108.6056 1112.0999 1124.7938 1160.4131 1179.0654 1194.0101 1203.0033 1209.6056 1250.2451 1293.2024 1299.6642 1307.0572 1333.1863 1339.7892 1356.0224 1364.0280 1389.3904 1409.4323 1414.7734 1434.1306 1442.0947 1463.0120 1468.7066 1473.9846 1482.1310 1517.1082 1529.1851 1590.5553 1614.3144 2944.8891 2989.5119 3023.2904 3056.7144 3073.9960 3122.1726 3142.5816 3156.5456 3164.4004 3181.1946 3185.5216 3370.6287
redmass: 4.6639 5.5887 10.5832 6.0705 5.7189 3.0725 5.5908 3.8653 1.8178 3.0676 3.6663 5.1280 6.4268 5.9761 3.3572 3.2111 5.5170 5.4691 3.7329 4.2620 5.6920 3.8455 2.9722 5.3524 5.0965 6.1495 6.0743 5.0004 1.2628 4.3230 5.8509 4.9277 10.4381 5.2554 5.1118 1.2625 1.8591 2.3009 2.0345 1.3347 1.3603 4.6583 3.3791 2.3474 2.6329 2.7438 1.7216 2.1127 1.3294 1.4521 1.1488 3.0618 1.4564 2.4562 4.6472 2.1990 1.8971 1.9393 5.0418 3.6592 1.5063 4.6490 4.8275 1.2541 3.2949 1.1960 2.2465 1.2714 1.1750 1.0951 1.1370 5.9129 4.6952 7.6923 6.3840 1.0704 1.0648 1.0342 1.0938 1.0942 1.1020 1.1018 1.0894 1.0893 1.0965 1.0978 1.0652
irintensity: 1.5616 0.3077 2.3127 1.7367 1.7645 4.3620 1.5493 1.6250 4.1914 3.5417 1.0461 2.5976 2.0134 1.4134 2.3221 2.7441 4.7822 0.2398 0.1623 1.7820 5.1913 2.0757 17.8244 12.9248 15.9860 2.3467 4.1789 2.6266 112.4107 18.8070 8.6158 9.2418 16.9720 22.0142 6.0055 4.5239 54.8631 26.0209 26.6091 0.0621 1.4127 16.8208 19.4210 14.3604 18.4774 47.7701 61.1080 67.6123 1.4546 97.5104 20.0695 82.5846 29.1549 23.9214 84.9802 52.5149 23.2251 22.0174 137.3397 133.0417 2.5075 152.8042 111.9727 93.7962 14.6079 4.7956 90.7131 38.7888 50.0175 2.0055 40.0854 43.7314 24.2690 6.6307 82.1719 79.1247 9.3915 14.1829 8.3989 53.5669 7.9760 2.2667 4.5334 1.3385 1.5667 2.0072 184.5862
temp: 298.150 k
press: 1.00000 atm
elementType: 9 8 8 8 7 7 7 6 6 6 6 6 6 6 6 6 6 6 6 1 1 1 1 1 1 1 1 1 1 1 1
symmnumber: 1
zpe: 603864.1 jmol-1
zpe.correction: 0.230000 hartree
zpe.thermalcorrener: 0.247158 hartree
zpe.thermalcorrenthalpy: 0.248102 hartree
zpe.thermalcorrgfe: 0.183537 hartree
zpe.sumelectzpe: -952.773375 hartree
zpe.sumelectthermal: -952.756217 hartree
zpe.sumelectthermalent: -952.755272 hartree
zpe.sumelectthermalfe: -952.819837 hartree
dipole: 3.6975 -2.7161 -1.6800
dipole: 4.8858
quadrupole: -131.1619 -120.1926 -107.9057
quadrupole: -10.6094 2.8765 -8.2182
quadrupole: -11.4085 -0.4392 11.8477 -10.6094 2.8765 -8.2182
hfenergy: -953.0033742 hartree
pointgroup: C01 [X(C12H12F1N3O3)]
dipole: 1.50441 1.0320053 0.6054917 debye
polarizability: 272.6975454|-18.150416|177.0683529|11.8031423|-29.1193263|94.3482957 unknown
InChI: InChI=1S/C12H12FN3O3/c1-15-11(8-2-4-9(13)5-3-8)14-10(6-7-17)12(15)16(18)19/h2-5,17H,6-7H2,1H3
charge 0 multiplicity 1
31 atoms
F  5.6458 -0.65704 0.415663
O  -1.894798 -3.502806 -0.290769
O  -4.311236 1.345084 -0.543399
O  -2.821343 3.069126 -0.788236
N  -0.673906 1.276534 -0.212103
N  -0.81093 -0.979856 0.017107
N  -3.102516 1.819099 -0.548292
C  -2.105128 -0.500296 -0.133224
C  0.03777 0.092583 -0.038889
C  -2.036497 0.904223 -0.290145
C  -3.28923 -1.427581 -0.148531
C  1.497007 -0.044782 0.072504
C  -0.133198 2.650754 -0.109688
C  -2.952053 -2.816083 0.447439
C  2.409151 0.771106 -0.654213
C  2.007721 -1.089847 0.893926
C  3.799798 0.571169 -0.543088
C  3.393833 -1.300485 1.016114
C  4.260847 -0.456792 0.297903
H  -3.631915 -1.556836 -1.195027
H  -4.134882 -0.961685 0.388517
H  0.85936 2.597729 0.361456
H  -0.059256 3.123561 -1.101932
H  -0.803224 3.266062 0.506098
H  -3.839925 -3.466658 0.378841
H  -2.683007 -2.703509 1.521115
H  2.041424 1.53501 -1.345801
H  1.303935 -1.732783 1.430281
H  4.512698 1.182288 -1.103139
H  3.79955 -2.095815 1.647175
H  -1.104748 -2.888075 -0.256362
