program: Gaussian 09
title: 000149299
version: EM64L-G09RevD.01
frameworkgroup: C1[X(C16H14)]
method: RPBEPBE
basis: SDD
operation: Freq
keyword: #p
keyword: freq=noraman
keyword: PBEPBE/SDD
title: #p freq=noraman PBEPBE/SDD
converged: NO YES NO NO
title: Mulliken charges:
elementType: C C C C C C C C C C C C C C C C H H H H H H H H H H H H H H
charge: 0.086595 0.216310 0.234726 0.458707 0.323597 0.376379 -0.773333 -0.354363 -0.476118 -0.399847 -0.431310 -0.854915 -0.259749 -0.878733 -0.290756 -0.268097 0.235701 0.242425 0.244647 0.248293 0.224212 0.231566 0.243070 0.231575 0.229658 0.236591 0.235000 0.235013 0.225352 0.227802
chargesum: 0.00000
title: Mulliken charges with hydrogens summed into heavy atoms:
elementType: C C C C C C C C C C C C C C C C
charge: 0.086595 0.216310 0.234726 0.458707 0.323597 0.376379 -0.537632 -0.111938 -0.231471 -0.151554 -0.207098 -0.148704 -0.030090 -0.172129 -0.065404 -0.040294
polarizability: 2.65549527e+02 -1.37135992e+01 2.03626706e+02 1.85595976e-03 2.26340494e-03 7.54767642e+01
1716.lowfreq: -8.0888 -0.0007 -0.0003 0.0004 7.5516 9.3715 11.2401 87.3213 132.5697
frequency: -5.9767 87.3182 132.5595 187.8918 212.6682 251.6898 264.2431 281.9990 316.7427 328.7876 352.1221 400.9937 428.9842 457.8516 476.5237 493.4601 542.7940 549.7599 557.1348 573.7249 621.4546 634.1267 674.2144 736.9729 757.0369 769.1872 785.3701 794.8829 825.0619 882.1667 887.6446 929.0117 955.6488 959.9004 981.1306 983.1297 988.8865 998.0052 1033.1098 1044.5167 1049.2196 1049.9180 1073.9457 1112.9196 1147.6217 1175.3839 1183.7727 1217.1940 1251.8254 1260.4075 1292.4521 1301.4656 1356.8587 1378.5893 1394.7725 1398.8682 1404.0643 1413.2268 1441.8476 1448.6875 1470.7034 1475.1592 1489.4547 1494.5549 1499.1468 1541.9178 1580.5274 1604.7976 1618.1106 1641.4082 2970.0582 2971.8818 3044.8765 3054.1548 3075.2717 3083.2807 3114.6231 3119.8124 3126.8734 3128.2896 3143.8299 3156.0536 3163.0935 3259.8773
redmass: 3.1006 3.5941 3.3732 3.0259 1.1479 4.6723 2.9437 2.9224 3.5003 3.4900 1.2543 5.9662 2.3971 4.0919 3.4704 5.3807 5.4865 3.2135 3.7876 3.1209 2.8140 6.1300 5.3325 2.3122 4.6218 1.5244 1.3339 5.5946 2.0266 1.8335 1.3743 1.6112 1.3890 2.1778 1.3785 7.3179 1.3280 1.9022 2.2815 1.5686 1.6068 3.1237 1.9957 1.9116 1.8067 1.2273 1.1402 1.4057 1.7455 2.6780 2.1207 2.3015 4.6872 4.9992 1.2300 1.2685 2.6009 2.6929 2.6081 2.2679 1.0468 1.3979 1.0486 2.0344 1.1819 3.8057 7.1032 5.5019 6.1094 6.9084 1.0377 1.0374 1.0973 1.0984 1.0974 1.0981 1.0911 1.0859 1.0858 1.0915 1.0913 1.1000 1.0987 1.0886
irintensity: 0.0590 0.0887 2.1795 3.7807 1.5883 0.5881 0.4304 0.8684 1.5428 0.2541 3.2605 0.3666 3.0697 1.1043 0.1800 1.2166 1.0957 0.8496 0.2803 0.5402 0.8680 0.1074 3.5698 48.7982 0.4172 74.1295 15.6889 1.2003 0.2753 0.0306 12.8550 16.6880 1.7906 2.0319 1.5989 2.8303 0.0618 5.7052 0.1412 4.7343 10.5538 7.4936 0.4949 7.2961 3.9394 3.6988 0.4312 2.2368 1.2464 0.0658 1.7184 6.8486 1.8562 3.2841 8.8279 12.0524 9.8061 4.2453 3.9535 18.9922 14.4528 2.9108 13.6417 8.4422 29.1450 2.7240 6.0404 3.3829 1.9809 8.0632 44.1979 24.9261 19.8585 16.5327 30.0791 18.3017 16.9341 1.1922 3.5604 30.5026 20.7087 43.6403 33.0545 7.2465
temp: 298.150 k
press: 1.00000 atm
elementType: 6 6 6 6 6 6 6 6 6 6 6 6 6 6 6 6 1 1 1 1 1 1 1 1 1 1 1 1 1 1
symmnumber: 1
zpe: 647894.5 jmol-1
zpe.correction: 0.246770 hartree
zpe.thermalcorrener: 0.258487 hartree
zpe.thermalcorrenthalpy: 0.259432 hartree
zpe.thermalcorrgfe: 0.209889 hartree
zpe.sumelectzpe: -617.029671 hartree
zpe.sumelectthermal: -617.017953 hartree
zpe.sumelectthermalent: -617.017009 hartree
zpe.sumelectthermalfe: -617.066552 hartree
dipole: 0.2132 -0.0695 0.0002
dipole: 0.2243
quadrupole: -82.0869 -81.1375 -101.0117
quadrupole: 1.8941 0.0000 0.0005
quadrupole: 5.9918 6.9412 -12.9330 1.8941 0.0000 0.0005
hfenergy: -617.2764405 hartree
pointgroup: C01 [X(C16H14)]
dipole: -0.0862296 -0.0187265 -0.0000948 debye
polarizability: 267.6733344|7.213883|201.5028991|0.0016179|-0.0024392|75.4767642 unknown
InChI: InChI=1S/C16H14/c1-11-6-5-7-13-10-12(2)14-8-3-4-9-15(14)16(11)13/h3-10H,1-2H3
charge 0 multiplicity 1
30 atoms
C  0.854544 -0.294912 0.000042
C  -0.594297 -0.599962 0.000037
C  -1.565245 0.485479 -0.000038
C  1.225571 1.109117 0.000043
C  -1.134214 1.876821 -0.000005
C  1.939759 -1.26126 0.000078
C  0.219879 2.143562 0.000053
C  -1.132859 -1.928485 0.000128
C  2.592399 1.519419 -0.000013
C  -2.964756 0.19011 -0.00013
C  3.275944 -0.801051 -0.000016
C  -2.140677 3.013084 -0.000083
C  3.617551 0.574223 -0.000083
C  1.787828 -2.778454 -0.000124
C  -2.510987 -2.190945 0.000077
C  -3.444399 -1.124131 -0.000119
H  0.56668 3.184693 0.000059
H  -0.471813 -2.788879 0.00023
H  2.81907 2.591955 -0.000043
H  -3.679006 1.018923 -0.000206
H  4.080834 -1.545365 -0.000054
H  -2.797533 2.981151 0.890276
H  -1.623638 3.987064 0.000118
H  -2.797176 2.981335 -0.890713
H  4.668716 0.881773 -0.00013
H  2.786211 -3.248112 -0.000375
H  1.255452 -3.149896 0.895262
H  1.255117 -3.149626 -0.895423
H  -2.85992 -3.229766 0.000157
H  -4.521436 -1.324267 -0.000204
