program: Gaussian 09
title: 000149338
version: EM64L-G09RevD.01
frameworkgroup: C1[X(C16H19N3O7)]
method: RPBEPBE
basis: SDD
operation: Freq
keyword: #p
keyword: freq=noraman
keyword: PBEPBE/SDD
title: #p freq=noraman PBEPBE/SDD
converged: YES YES NO NO
title: Mulliken charges:
elementType: O O O O O O O N N N C C C C C C C C C C C C C C C C H H H H H H H H H H H H H H H H H H H
charge: -0.279798 -0.288321 -0.289056 -0.292028 -0.267622 -0.207825 -0.243750 -0.200456 -0.086280 0.045245 -0.412095 -0.294616 0.242294 0.324890 -0.354511 -0.772322 0.285796 0.176401 -0.493789 -0.524263 0.264273 0.315549 0.063967 -0.522101 -0.534000 -0.511759 0.265400 0.280404 0.273158 0.231062 0.290492 0.242131 0.269718 0.287509 0.287164 0.292817 0.231525 0.263405 0.215604 0.245880 0.228113 0.233219 0.232110 0.222091 0.264378
chargesum: 0.00000
title: Mulliken charges with hydrogens summed into heavy atoms:
elementType: O O O O O O O N N N C C C C C C C C C C C C C C C C
charge: -0.279798 -0.288321 -0.289056 -0.292028 -0.267622 -0.207825 -0.243750 -0.200456 -0.086280 0.045245 0.133709 0.209603 0.242294 0.324890 -0.064019 0.027036 0.285796 0.176401 -0.206626 -0.231445 0.264273 0.315549 0.063967 0.188433 0.173212 0.206820
polarizability: 3.42997867e+02 3.33996963e+00 2.66710395e+02 -2.11893494e+01 -1.80483024e+00 1.20547764e+02
1716.lowfreq: -5.5342 -3.2345 0.0004 0.0006 0.0009 3.8463 14.6911 22.1671 23.4168
frequency: 14.4642 22.1053 23.2967 47.8401 56.5811 67.1095 73.1426 73.5572 85.5778 91.0694 99.7318 107.2131 133.7020 146.5833 151.2575 167.5225 175.1071 182.3013 207.7761 211.9407 224.6917 243.7287 274.8198 281.9146 284.3300 300.7648 305.8419 326.1193 346.5039 356.1817 370.3585 379.3896 405.6465 438.3926 453.1281 500.5447 527.2233 547.7858 567.8899 596.9305 598.3834 620.3591 661.9352 679.9475 688.9641 692.2038 726.6330 731.5497 753.5515 763.0556 768.5638 806.2039 849.4923 868.3108 872.2399 878.2482 913.9653 932.9150 945.5752 954.2788 988.1473 990.5399 1041.7798 1050.0091 1063.2988 1078.8148 1104.6355 1108.4210 1109.6210 1111.9609 1142.3835 1145.9684 1153.3727 1159.2912 1165.8336 1173.9912 1205.1625 1212.9945 1228.4496 1236.9312 1279.8573 1310.0228 1310.4219 1327.2779 1332.8960 1346.7848 1379.6600 1383.6248 1404.3532 1407.2150 1411.5221 1419.7141 1436.4887 1444.2337 1451.9673 1454.8973 1457.6186 1458.7550 1464.6747 1466.9128 1468.2171 1477.0472 1478.3654 1480.1389 1482.5795 1483.1828 1493.3475 1571.3211 1597.6972 1613.8558 2969.5565 2977.7546 2983.1125 2989.3209 3030.2201 3061.3420 3062.5424 3064.7826 3086.0024 3100.1138 3120.6158 3124.8459 3130.6008 3130.6743 3136.0119 3137.8741 3179.5070 3191.4609 3251.9362
redmass: 5.6755 6.2478 6.1024 6.2395 2.9652 2.7914 5.0959 2.7034 5.2682 6.9656 2.6972 4.0539 2.0745 2.5157 2.0110 1.9394 1.2122 2.6567 3.2678 4.3165 2.0383 7.4121 2.0601 3.7691 4.7693 4.0764 3.9269 2.6155 3.8886 6.9626 5.2364 5.6173 7.0342 6.1206 5.5391 6.6244 6.5191 4.9903 5.1690 4.8612 4.8263 5.1215 5.0804 5.5166 5.7841 6.5277 4.0879 5.0854 7.7567 4.1853 4.7368 1.7466 5.3202 1.4407 1.5390 6.2134 1.5550 3.6216 8.0911 8.4082 1.7224 6.9265 3.2286 1.7308 4.5968 3.0376 2.9184 1.2447 1.2365 1.2580 2.2279 1.6992 1.4410 1.4555 2.8411 2.7815 2.0168 3.2133 1.7347 1.8038 1.3696 4.4281 4.7395 2.7709 1.9640 2.0132 4.7367 1.4921 2.6863 1.6980 1.7235 1.3511 1.3319 1.3671 1.2286 1.3242 1.1472 1.2098 2.1747 1.1066 1.3946 1.2423 1.2384 1.1519 2.0348 1.1127 1.4548 8.2828 6.4457 9.9209 1.0324 1.0340 1.0413 1.0322 1.0616 1.1044 1.0666 1.0879 1.0986 1.1002 1.1024 1.0980 1.1045 1.1005 1.1053 1.1072 1.0923 1.0912 1.0994
irintensity: 1.6329 0.3299 1.9211 1.0624 2.2533 5.9899 0.8897 8.5335 1.8059 2.1243 3.2748 0.4926 1.5062 0.8995 4.6998 6.8070 0.3479 2.3016 3.7114 1.2940 1.2962 8.8603 0.6867 3.4108 4.1599 5.9380 20.7834 11.7677 11.4027 5.3021 2.1645 6.3155 6.9241 4.1389 11.6948 0.5747 9.2717 0.4352 2.3749 2.8065 3.7694 4.5099 6.1777 7.7297 9.9293 4.5518 15.6723 25.1755 12.9606 9.5433 8.5104 4.3465 18.5157 22.9786 14.4808 20.5762 26.8304 6.5691 16.6175 74.0917 23.5032 218.5147 12.5178 5.9564 312.1966 42.4665 45.9265 17.1082 5.2180 0.2686 33.1246 67.5131 74.5903 35.0355 227.2822 205.1506 6.2045 2.0328 157.8992 36.3057 4.8451 344.0035 220.5406 284.3564 13.2660 11.1617 32.5548 36.6038 58.4389 24.6507 48.4624 20.4350 50.8030 26.1502 65.5715 30.5377 35.5506 44.7737 135.8005 29.2958 65.2533 25.5239 30.6899 2.7187 18.1763 27.0479 18.6795 175.0679 21.3596 232.4976 49.7584 86.3062 6.2310 79.5403 18.0069 36.7026 23.7553 1.6994 32.2627 31.5049 0.8518 2.7492 17.1457 18.8616 13.6332 1.3547 1.8403 2.9963 2.6563
temp: 298.150 k
press: 1.00000 atm
elementType: 8 8 8 8 8 8 8 7 7 7 6 6 6 6 6 6 6 6 6 6 6 6 6 6 6 6 1 1 1 1 1 1 1 1 1 1 1 1 1 1 1 1 1 1 1
symmnumber: 1
zpe: 896427.5 jmol-1
zpe.correction: 0.341431 hartree
zpe.thermalcorrener: 0.368036 hartree
zpe.thermalcorrenthalpy: 0.368980 hartree
zpe.thermalcorrgfe: 0.281541 hartree
zpe.sumelectzpe: -1309.847566 hartree
zpe.sumelectthermal: -1309.820961 hartree
zpe.sumelectthermalent: -1309.820017 hartree
zpe.sumelectthermalfe: -1309.907456 hartree
dipole: -6.2132 1.0612 0.7240
dipole: 6.3447
quadrupole: -166.9121 -154.3250 -147.2046
quadrupole: -18.9054 -0.3107 1.8987
quadrupole: -10.7649 1.8222 8.9427 -18.9054 -0.3107 1.8987
hfenergy: -1310.188997 hartree
pointgroup: C01 [X(C16H19N3O7)]
dipole: 2.4438564 0.4384635 -0.2573484 debye
polarizability: 343.6583003|-2.9292375|266.6418747|-17.7332482|-1.7489276|119.9558507 unknown
InChI: InChI=1S/C16H19N3O7/c1-10-17-9-14(19(21)22)18(10)5-6-26-16(20)11-7-12(23-2)15(25-4)13(8-11)24-3/h7-9H,5-6H2,1-4H3
charge 0 multiplicity 1
45 atoms
O  -0.602605 0.56093 0.487141
O  4.701453 -2.332353 -0.151901
O  4.069818 2.507506 0.027411
O  5.776671 0.284042 -0.242996
O  -0.350849 -1.760299 0.488528
O  -6.601787 2.152935 -0.125941
O  -4.324172 2.377993 -0.275713
N  -4.09689 -0.48625 -0.475941
N  -5.785156 -1.996661 -0.211823
N  -5.411264 1.654056 -0.2287
C  -2.724264 0.026004 -0.673622
C  -2.055422 0.355142 0.681812
C  -4.442847 -1.836267 -0.422422
C  -5.296532 0.232971 -0.28139
C  -6.316321 -0.72297 -0.128862
C  -3.468813 -2.957654 -0.594905
C  1.61638 -0.329483 0.260064
C  0.172357 -0.617175 0.418107
C  2.106462 1.001486 0.208101
C  2.507274 -1.423604 0.175836
C  3.88892 -1.200568 0.010786
C  3.487488 1.230309 0.052559
C  4.396791 0.130669 -0.083931
C  5.860211 -2.477871 0.758325
C  3.180064 3.65995 0.213937
C  6.267597 1.179577 -1.317452
H  -2.149565 -0.762909 -1.183165
H  -2.756405 0.924019 -1.306258
H  -2.426537 1.308643 1.084434
H  -2.214999 -0.470805 1.39808
H  -7.373035 -0.53666 0.042112
H  -3.17009 -3.076669 -1.654492
H  -3.962459 -3.889199 -0.279829
H  -2.545544 -2.814087 -0.005918
H  1.398339 1.826546 0.302604
H  2.131946 -2.449183 0.222825
H  6.338936 -3.421296 0.455863
H  6.557252 -1.631891 0.646874
H  5.511749 -2.55241 1.806412
H  3.841904 4.537746 0.190327
H  2.435069 3.728849 -0.601554
H  2.661787 3.606927 1.189982
H  7.360282 1.051336 -1.307178
H  5.858205 0.8580 -2.292918
H  5.990899 2.224528 -1.109907
