program: Gaussian 09
title: 000149316
version: EM64L-G09RevD.01
frameworkgroup: C1[X(C20H21NO2)]
method: RPBEPBE
basis: SDD
operation: Freq
keyword: #p
keyword: freq=noraman
keyword: PBEPBE/SDD
title: #p freq=noraman PBEPBE/SDD
converged: YES YES NO NO
title: Mulliken charges:
elementType: O O N C C C C C C C C C C C C C C C C C C C C H H H H H H H H H H H H H H H H H H H H H
charge: -0.504035 -0.454478 -0.386900 -0.154249 -0.210344 0.322166 0.339905 -0.666949 0.356059 0.262464 0.380140 -0.545980 0.544949 -0.457207 -0.445931 -0.438766 -0.464569 -0.347686 -0.350506 -0.448633 -0.710415 -0.452802 -0.214012 0.248562 0.248423 0.231976 0.183494 0.283669 0.242845 0.232218 0.232597 0.231783 0.199975 0.201315 0.226958 0.185467 0.242969 0.186869 0.242900 0.236417 0.241033 0.218344 0.361593 0.368372
chargesum: 0.00000
title: Mulliken charges with hydrogens summed into heavy atoms:
elementType: O O N C C C C C C C C C C C C C C C C C C C C
charge: -0.142442 -0.086106 -0.103231 -0.154249 -0.210344 0.322166 0.339905 -0.169964 0.356059 0.262464 0.380140 -0.130510 0.544949 -0.214363 -0.213713 -0.206169 -0.232785 0.053603 0.061919 -0.205663 -0.044230 -0.211768 0.004331
polarizability: 3.36189497e+02 -2.11586581e+01 2.60774681e+02 1.89151179e+01 3.99953497e+00 1.27047536e+02
1716.lowfreq: -7.0282 -4.9249 -0.0009 -0.0007 -0.0006 2.0359 16.1336 20.4660 34.9272
frequency: 15.7357 19.2283 34.8992 90.0253 99.4107 109.1964 131.3091 153.9507 168.0464 198.1754 198.8444 219.9413 239.1322 250.8222 260.2074 275.2167 280.1980 314.7300 335.8471 371.6736 381.9768 394.2494 419.4549 432.2732 436.4700 451.0071 481.2309 498.7056 505.8758 521.4818 540.9127 574.8905 587.4686 610.6817 627.0241 627.5954 661.2754 684.4696 714.4731 736.2846 751.6645 772.6236 787.0258 822.0795 832.3953 834.4871 888.1669 901.6792 911.2585 932.7140 938.3055 944.1298 957.1602 961.8373 966.6109 971.1899 973.6467 981.3903 988.8071 1008.5119 1014.4989 1034.9808 1085.4967 1096.3206 1129.3784 1137.0267 1146.4214 1151.6939 1156.9706 1160.9727 1177.5022 1187.6908 1196.5253 1209.7132 1224.5932 1234.9538 1241.1890 1252.9842 1265.1787 1278.3280 1324.2304 1331.8791 1349.0352 1379.3408 1380.9289 1395.1882 1397.5416 1405.2338 1413.2448 1421.5097 1425.3204 1442.7537 1443.6910 1457.3676 1463.3981 1476.0920 1480.4402 1486.4806 1496.4669 1508.7638 1517.4468 1594.3736 1603.7181 1628.5789 1645.1264 2878.7672 2921.4877 2941.6737 2980.3157 2990.4499 2991.6924 3003.6448 3036.2085 3065.4319 3079.6033 3116.9215 3118.1374 3121.7421 3124.4846 3135.6771 3141.6371 3147.1483 3154.2663 3401.0950 3489.8121 3583.3725
redmass: 5.2123 4.2305 5.1301 4.4210 5.0362 3.4831 3.1357 4.4976 2.2429 1.4188 2.9921 2.9987 1.2379 2.6148 2.0394 4.2235 3.8934 2.9551 1.8212 2.2496 4.4428 3.2043 4.1684 3.4330 2.7285 3.2822 5.5771 3.3437 2.9016 4.5830 3.8868 4.9398 4.3206 3.3766 3.6310 1.3610 3.7737 6.2978 2.9055 3.1590 3.5753 1.3149 4.9786 2.5993 1.8392 1.6536 3.4221 1.5782 2.1793 1.4549 1.6827 2.9569 2.5559 1.5581 1.4965 2.2950 1.8769 1.3995 2.8306 5.6774 3.8153 2.3056 2.6194 2.5524 1.1443 1.5372 2.2718 1.4820 1.8233 1.4326 1.2810 1.2520 1.2357 1.6719 1.7384 2.0662 1.8706 1.6953 1.8406 1.5142 1.8844 1.5338 1.6005 1.6748 1.9452 3.0720 1.3010 3.2190 1.1971 3.1966 1.1383 1.7462 1.6832 1.0698 1.0705 1.0851 1.0924 6.2245 3.5956 1.1122 5.5107 7.3273 7.2059 9.4006 8.5670 1.0709 1.0691 1.0545 1.0411 1.0607 1.0875 1.1083 1.0998 1.0934 1.0939 1.0859 1.0993 1.0859 1.0878 1.0923 1.0957 1.0956 1.0980 1.0654 1.0761 1.0670
irintensity: 2.4442 2.0852 0.0684 2.2977 0.9118 1.2203 1.3372 0.3833 6.3571 7.1642 8.5732 0.9527 125.5791 3.1296 3.0684 14.6486 2.0258 2.2485 24.5414 11.4629 6.6360 23.7654 0.5803 3.1293 16.8405 5.2648 3.9181 5.3717 2.7699 0.7037 2.1995 1.6681 4.4086 21.9129 3.9043 145.0570 7.3093 0.0567 8.7174 17.3277 11.8237 32.6250 2.2932 30.7171 41.9017 15.4700 1.0199 12.8989 8.9286 4.9665 11.0719 18.4114 56.1553 2.6467 1.5239 1.9125 2.6415 5.3762 0.6687 160.9317 0.2657 4.2954 11.4710 3.7012 0.0056 75.9117 7.4187 3.5637 13.1930 7.2195 1.3205 1.2253 0.8196 37.4444 1.2132 8.1276 2.6701 4.3686 1.4767 13.0999 11.7662 10.4361 0.7422 6.0262 5.2242 6.6205 14.1124 9.5274 72.2221 3.8395 18.4554 42.7153 6.6787 3.9264 0.8842 23.4930 19.8050 0.4340 1.4202 8.0363 1.4701 5.4503 2.7410 0.4466 1.0087 51.8962 74.4522 99.1343 21.9108 17.1151 39.2750 60.1648 6.7917 26.8565 31.6581 2.0289 15.7093 0.3479 9.5299 15.7214 41.7389 24.3565 43.5902 97.3677 1.3183 2.4944
temp: 298.150 k
press: 1.00000 atm
elementType: 8 8 7 6 6 6 6 6 6 6 6 6 6 6 6 6 6 6 6 6 6 6 6 1 1 1 1 1 1 1 1 1 1 1 1 1 1 1 1 1 1 1 1 1
symmnumber: 1
zpe: 945374.1 jmol-1
zpe.correction: 0.360074 hartree
zpe.thermalcorrener: 0.380573 hartree
zpe.thermalcorrenthalpy: 0.381518 hartree
zpe.thermalcorrgfe: 0.310144 hartree
zpe.sumelectzpe: -978.270205 hartree
zpe.sumelectthermal: -978.249705 hartree
zpe.sumelectthermalent: -978.248761 hartree
zpe.sumelectthermalfe: -978.320135 hartree
dipole: 4.3198 -2.4114 -0.5834
dipole: 4.9816
quadrupole: -154.9103 -116.2526 -139.1198
quadrupole: 17.0265 6.7182 3.2523
quadrupole: -18.1494 20.5083 -2.3589 17.0265 6.7182 3.2523
hfenergy: -978.6302789 hartree
pointgroup: C01 [X(C20H21N1O2)]
dipole: 1.7368094 0.8842042 0.2071788 debye
polarizability: 337.1216904|18.3678511|259.2864993|-21.5658798|4.6211241|127.6035239 unknown
InChI: InChI=1S/C20H21NO2/c1-20(11-22,12-23)21-10-16-6-5-15-9-14-4-2-3-13-7-8-17(16)19(15)18(13)14/h2-8,21-23H,9-12H2,1H3
charge 0 multiplicity 1
44 atoms
O  -5.14585 2.320157 0.37584
O  -6.414068 -0.056466 0.365437
N  -2.74102 -0.478724 -0.445663
C  1.702708 -0.665141 0.11997
C  2.803642 0.22004 -0.017678
C  2.120942 -2.009844 -0.062204
C  0.392038 -0.217284 0.406744
C  3.637831 -2.000933 -0.348675
C  3.995156 -0.499362 -0.298238
C  -4.033611 0.246697 -0.41581
C  -0.607692 -1.247007 0.521932
C  -2.062607 -0.904378 0.803396
C  2.678811 1.622479 0.118959
C  1.136785 -3.000047 0.051079
C  -0.209319 -2.59216 0.340381
C  0.24994 1.227473 0.549432
C  1.335316 2.10052 0.413612
C  -3.824608 1.674607 0.180587
C  -5.046464 -0.558245 0.45805
C  5.169717 0.24775 -0.459478
C  -4.549023 0.354557 -1.86641
C  3.891197 2.364227 -0.049826
C  5.0926 1.677658 -0.330753
H  3.873367 -2.446423 -1.334778
H  4.202244 -2.58362 0.405084
H  -2.57282 -1.794798 1.218328
H  -2.100553 -0.123687 1.600918
H  -2.09764 -0.150163 -1.173592
H  1.360722 -4.065242 -0.072728
H  -0.98011 -3.36805 0.422287
H  -0.738624 1.645046 0.774764
H  1.172729 3.178858 0.533979
H  -3.209457 2.276249 -0.521039
H  -3.303281 1.601251 1.158633
H  -5.071739 -1.599543 0.094222
H  -4.70566 -0.561184 1.518454
H  6.135567 -0.221456 -0.677791
H  -3.803731 0.866541 -2.506792
H  -5.492773 0.921531 -1.904474
H  -4.727009 -0.654292 -2.275278
H  3.895668 3.457036 0.037491
H  6.013425 2.259216 -0.456965
H  -5.044487 3.206798 0.799834
H  -6.355759 0.933456 0.493161
