program: Gaussian 09
title: 000149351
version: EM64L-G09RevD.01
frameworkgroup: C1[X(C20H34O5)]
method: RPBEPBE
basis: SDD
operation: Freq
keyword: #pfreq=noraman
keyword: PBEPBE/SDD
title: #p freq=noraman PBEPBE/SDD
converged: YES YES NO NO
title: Mulliken charges:
elementType: O O O O O C C C C C C C C C C C C C C C C C C C C H H H H H H H H H H H H H H H H H H H H H H H H H H H H H H H H H H
charge: -0.427704 -0.178381 -0.444866 -0.424934 -0.233216 -0.174107 -0.224311 -0.128771 -0.537683 -0.409228 0.086664 -0.406747 -0.199513 -0.388003 -0.263936 -0.399741 -0.157720 -0.409673 -0.384285 -0.363454 -0.484233 -0.350546 -0.337442 0.186080 -0.707884 0.241485 0.253891 0.202167 0.260008 0.246414 0.206954 0.206099 0.196624 0.247956 0.239808 0.204059 0.182187 0.341720 0.264280 0.193018 0.208929 0.185391 0.221689 0.210629 0.214519 0.227844 0.187415 0.195940 0.190942 0.190147 0.249834 0.258107 0.341376 0.192086 0.176178 0.206430 0.207570 0.237370 0.374568
chargesum: 0.00000
title: Mulliken charges with hydrogens summed into heavy atoms:
elementType: O O O O O C C C C C C C C C C C C C C C C C C C C
charge: -0.085984 -0.178381 -0.103490 -0.050366 -0.233216 0.067378 0.029580 0.073396 -0.031261 0.003824 0.086664 0.037832 0.040295 -0.001757 0.000344 0.002207 0.027672 0.022645 0.058078 0.019902 0.023708 0.030543 0.030821 0.186080 -0.056514
polarizability: 2.60123310e+02 -1.10766062e+01 2.55607332e+02 6.10428544e+00 -3.03077063e+00 1.82474946e+02
1716.lowfreq: -6.2942 0.0001 0.0005 0.0010 2.9137 4.8749 8.3051 14.0301 18.1631
frequency: 5.5890 13.6714 17.6774 24.6355 32.8280 41.1540 50.6726 51.5993 62.2030 67.7241 77.7078 80.5670 95.5985 103.7715 110.8299 117.2010 130.4931 142.1316 151.5600 178.8565 199.9606 209.9724 232.6915 245.2863 257.0280 261.8217 276.7053 279.5726 292.2951 306.4315 342.6079 355.0739 358.7572 402.0191 413.1829 422.6138 452.3951 464.4102 476.7318 489.5696 503.5366 511.5167 539.6484 544.0080 588.0644 613.3147 625.9319 643.3274 718.1255 729.6619 733.4932 755.9961 769.9257 806.6311 824.4854 833.1674 851.1247 866.1457 882.6114 889.2604 895.5081 931.8115 943.5334 966.7662 970.2321 980.0720 986.0388 996.5619 1002.3687 1016.5541 1019.4345 1037.4061 1039.8284 1047.6551 1057.8983 1067.6328 1074.1329 1081.6244 1093.2396 1104.5340 1109.0035 1110.6354 1115.1853 1129.0586 1139.9563 1150.9518 1162.7504 1171.2171 1180.5480 1190.3024 1205.5015 1221.3212 1225.5385 1229.6958 1240.1098 1245.9468 1249.1987 1254.7588 1263.5759 1268.3226 1276.1645 1278.9701 1283.4134 1285.0968 1289.0304 1295.9146 1298.4579 1300.7516 1303.2198 1313.5894 1317.5608 1334.4157 1336.8483 1347.8903 1349.7470 1356.6456 1360.2696 1367.1874 1372.0431 1385.1477 1387.9644 1427.4792 1438.7436 1459.7563 1463.0359 1463.9300 1465.9732 1468.8506 1470.9199 1477.7230 1480.5805 1483.2344 1485.4547 1487.7323 1654.2538 1667.6897 1678.4598 2922.4566 2932.5391 2945.6508 2948.6239 2952.1395 2953.5734 2961.6160 2961.9361 2965.2765 2971.4065 2971.9100 2986.2625 2987.0239 2987.7482 2990.7642 2994.7226 2999.1681 2999.8663 3005.2286 3014.2895 3024.6113 3027.0924 3038.1818 3048.7862 3051.1704 3052.1694 3065.2768 3065.8443 3070.0980 3076.7769 3090.8440 3507.5391 3548.9672 3564.5422
redmass: 6.7204 6.6548 5.4208 4.5934 5.5857 3.9941 2.2237 4.6034 4.0079 2.8861 3.1993 2.5672 3.2202 2.3183 3.3729 2.0287 3.1657 2.3180 3.4011 3.8638 3.1452 2.8745 2.7391 1.1046 3.7235 3.0290 1.9420 3.8820 1.4552 3.3148 2.1336 1.6768 2.0602 3.1803 3.2333 3.8800 3.5656 2.7197 3.3883 3.1409 2.9113 1.9890 4.2251 2.7381 3.9808 3.4910 3.3478 1.3592 1.2113 1.0744 1.6202 1.1334 1.7445 1.6331 1.6500 1.6804 2.0181 2.0840 2.7978 2.0731 2.0899 1.6205 4.8565 1.8689 2.3185 1.1284 2.1088 2.7542 2.5480 2.9951 2.4433 2.1266 2.0440 2.3125 2.6437 2.2291 2.5245 2.0562 2.4092 1.7537 2.4260 2.2902 2.3139 1.5336 1.7936 1.8117 1.4867 1.6510 1.4374 1.4887 1.3318 1.3391 1.4222 1.4656 1.5022 1.2661 1.3500 1.2830 1.2732 1.2928 1.3323 1.2284 1.2096 1.1133 1.1740 1.2673 1.1962 1.1671 1.2625 1.5207 1.3196 1.4100 1.4245 1.5292 1.4510 1.6457 1.5496 1.7227 1.5479 1.5673 1.2187 1.1029 1.0836 1.0794 1.0760 1.0696 1.0830 1.0753 1.0755 1.0874 1.0728 1.0506 1.0966 1.0827 11.9131 8.1870 6.8194 1.0795 1.0839 1.0844 1.0597 1.0592 1.0610 1.0598 1.0596 1.0629 1.0644 1.0360 1.0610 1.0821 1.0748 1.0723 1.0747 1.1005 1.0644 1.0926 1.0996 1.0978 1.1042 1.0966 1.0902 1.1024 1.1035 1.1009 1.1004 1.0987 1.0995 1.0902 1.0639 1.0661 1.0663
irintensity: 0.7658 0.4177 0.1356 0.4061 1.3115 1.1672 0.0381 0.4124 0.7364 0.2079 0.7453 0.1764 6.3291 0.8193 1.5037 0.6045 0.9269 0.2641 1.3818 0.4013 1.1071 3.3380 3.1476 0.4673 4.3598 3.8323 35.3446 12.0605 81.8839 16.7991 25.6880 63.3792 68.1663 0.3014 7.5097 16.6702 6.1043 1.0739 22.4346 0.7251 9.7640 24.2399 7.8087 2.0400 25.9559 15.4338 0.7031 138.5982 24.4094 11.8124 10.1954 0.4794 3.8774 5.9735 1.7256 2.3139 3.3478 6.9853 5.5506 7.5690 19.0368 0.3984 75.2204 6.9154 10.2633 74.8875 5.0055 11.1591 62.5089 8.3810 53.0986 78.4955 54.8635 57.3405 9.1295 59.9252 2.4780 2.9967 2.0284 10.2935 1.8184 16.8249 28.1461 7.4634 14.9768 42.6981 21.2983 12.5586 9.1090 8.4139 2.5534 32.2797 15.8373 8.6411 3.5441 13.1126 22.5592 16.5836 2.3936 8.5601 11.0642 1.0028 4.5512 1.0122 2.7089 19.5405 4.8998 2.9342 5.5476 34.1723 11.1928 12.6180 1.5109 1.9105 0.4653 2.2839 4.3798 31.0094 34.9456 13.2720 12.6148 15.4946 16.2058 2.0429 1.6141 0.1376 10.4124 2.0878 0.2639 12.9608 4.7568 11.3149 16.4367 17.7677 171.8689 200.0130 11.2770 5.3776 37.5638 42.0539 19.4306 4.8541 25.2983 22.6165 89.1377 36.6456 35.5280 42.1182 48.1836 9.1466 4.3158 7.1217 15.9472 1.0634 20.8040 49.6332 6.0292 47.9648 35.3126 2.0806 8.5528 73.4625 67.0346 44.9432 98.3162 13.6756 36.3862 17.5425 18.8943 5.4395 4.8602
temp: 298.150 k
press: 1.00000 atm
elementType: 8 8 8 8 8 6 6 6 6 6 6 6 6 6 6 6 6 6 6 6 6 6 6 6 6 1 1 1 1 1 1 1 1 1 1 1 1 1 1 1 1 1 1 1 1 1 1 1 1 1 1 1 1 1 1 1 1 1 1
symmnumber: 1
zpe: 1329650.7 jmol-1
zpe.correction: 0.506437 hartree
zpe.thermalcorrener: 0.536396 hartree
zpe.thermalcorrenthalpy: 0.537341 hartree
zpe.thermalcorrgfe: 0.439154 hartree
zpe.sumelectzpe: -1156.628304 hartree
zpe.sumelectthermal: -1156.598345 hartree
zpe.sumelectthermalent: -1156.597401 hartree
zpe.sumelectthermalfe: -1156.695588 hartree
dipole: 1.2993 -0.2183 0.5361
dipole: 1.4224
quadrupole: -133.8823 -181.7383 -153.8346
quadrupole: -9.5373 13.7878 5.6187
quadrupole: 22.6028 -25.2532 2.6504 -9.5373 13.7878 5.6187
hfenergy: -1157.1347415 hartree
pointgroup: C01 [X(C20H34O5)]
dipole: 0.4990512 0.1288664 -0.218004 debye
polarizability: 258.2338228|11.4339086|257.3616875|-7.1783435|-1.3994623|182.6100782 unknown
InChI: InChI=1S/C20H34O5/c1-2-3-6-9-15(21)12-13-17-16(18(22)14-19(17)23)10-7-4-5-8-11-20(24)25/h12-13,15-17,19,21,23-24H,2-11,14H2,1H3
charge 0 multiplicity 1
59 atoms
O  5.585817 0.35123 -0.219687
O  2.427903 4.028738 0.275262
O  3.165639 -4.348112 -0.443586
O  -5.873079 -0.404413 -0.532508
O  -4.877993 0.989776 -2.098061
C  2.073723 1.586015 -0.079669
C  3.155658 0.461105 0.017203
C  4.401439 1.094026 -0.662398
C  4.375459 2.572707 -0.213135
C  0.904855 1.469174 0.926149
C  2.889475 2.891049 0.020624
C  -0.343341 2.292949 0.535732
C  2.71511 -0.843903 -0.5929
C  -1.468253 2.190715 1.591405
C  2.576313 -2.019674 0.072266
C  -2.732437 3.018691 1.247017
C  2.112891 -3.306592 -0.571757
C  0.862203 -3.913092 0.090962
C  -3.547256 2.513919 0.029565
C  -0.393784 -3.025852 -0.043743
C  -4.22956 1.155413 0.292368
C  -1.656141 -3.664743 0.577078
C  -2.892273 -2.739721 0.50847
C  -4.986835 0.624234 -0.907262
C  -4.172206 -3.374655 1.092507
H  1.648286 1.566903 -1.110633
H  3.418202 0.305154 1.083708
H  4.295739 1.030161 -1.768309
H  4.900534 2.665663 0.759562
H  4.83453 3.293785 -0.911765
H  0.627815 0.39775 1.007019
H  1.256712 1.785142 1.929283
H  -0.712087 1.938612 -0.448867
H  -0.052717 3.352734 0.407734
H  2.467142 -0.808623 -1.668239
H  -1.070244 2.545618 2.563934
H  -1.736271 1.123876 1.745827
H  6.385679 0.701635 -0.686788
H  2.827673 -2.085985 1.141835
H  -3.39837 3.050974 2.134159
H  -2.421861 4.065215 1.053922
H  1.90376 -3.118794 -1.649312
H  0.682078 -4.90142 -0.37537
H  1.087272 -4.100029 1.159478
H  -4.324947 3.260561 -0.22123
H  -2.904868 2.4344 -0.86639
H  -0.586439 -2.811312 -1.116258
H  -0.206485 -2.044434 0.439294
H  -1.454265 -3.928396 1.636281
H  -1.881847 -4.619093 0.057381
H  -4.927032 1.214056 1.148777
H  -3.482049 0.383726 0.565572
H  4.030493 -3.94758 -0.718124
H  -3.072706 -2.450128 -0.547564
H  -2.665658 -1.799696 1.055185
H  -4.434923 -4.303143 0.550664
H  -4.034475 -3.638723 2.158175
H  -5.028732 -2.680269 1.017739
H  -6.332966 -0.748021 -1.346683
