program: Gaussian 09
title: 000149290
version: EM64L-G09RevD.01
frameworkgroup: C1[X(C9H10BrNO)]
method: RPBEPBE
basis: SDD
operation: Freq
keyword: #p
keyword: freq=noraman
keyword: PBEPBE/SDD
title: #p freq=noraman PBEPBE/SDD
converged: YES YES NO NO
title: Mulliken charges:
elementType: Br O N C C C C C C C C C H H H H H H H H H H
charge: -0.065436 -0.250843 -0.440099 0.491454 0.531980 -0.441509 -0.344109 -0.329195 -0.349718 -0.853001 0.215664 -0.798371 0.220767 0.311505 0.236970 0.236240 0.311159 0.283015 0.285552 0.240615 0.271363 0.235997
chargesum: 0.00000
title: Mulliken charges with hydrogens summed into heavy atoms:
elementType: Br O N C C C C C C C C C
charge: -0.065436 -0.250843 -0.128940 0.491454 0.531980 -0.220742 -0.032604 -0.092226 -0.113478 -0.284434 0.215664 -0.050396
polarizability: 2.21645238e+02 2.30945707e-01 1.09227129e+02 -8.27595182e-01 -4.07459582e+00 7.70022786e+01
1716.lowfreq: -73.1705 -16.9777 -5.6927 -0.0009 -0.0009 -0.0008 3.0143 34.8849 44.1137
frequency: -73.1597 34.8587 44.1065 73.8679 94.6190 150.2149 180.9998 285.8102 305.8552 340.7459 369.1476 408.7183 482.9646 495.1862 567.5495 584.4806 618.3506 638.2329 646.5689 740.1246 780.9735 828.8030 835.6150 865.9340 873.7060 930.3697 951.4905 984.5756 994.6958 1008.3959 1031.1358 1086.4259 1138.7461 1187.6597 1200.7856 1219.0986 1238.3917 1267.6035 1314.5558 1375.2527 1377.7037 1418.1185 1448.0825 1459.7615 1467.9261 1497.5475 1514.0500 1589.9797 1622.1090 1638.5222 2987.8173 3069.4868 3072.7913 3111.9780 3133.7420 3137.3967 3144.0096 3154.2452 3199.1075 3520.1711
redmass: 1.0531 6.9688 5.0179 4.8366 5.7835 4.0467 5.5431 3.4396 4.3606 5.2166 3.2759 2.9208 3.8026 4.5501 3.1675 2.8177 5.2143 5.8866 1.1835 3.7009 4.2387 1.4558 4.1810 1.5379 1.4885 6.1043 1.3870 1.6870 1.3330 2.6524 1.6661 1.1871 1.1851 1.1631 1.1302 3.2371 2.4847 2.1521 1.4686 2.1915 1.6817 3.7589 1.1442 1.1350 1.0476 1.9117 2.9678 5.3336 5.7167 5.4074 1.0385 1.0576 1.0984 1.0883 1.0915 1.0979 1.0962 1.1112 1.0945 1.0764
irintensity: 0.0406 1.6787 2.9556 6.4026 0.8690 5.8819 5.8136 2.0024 0.6063 35.2442 1.4362 0.0220 27.9665 10.3912 85.1019 15.8581 14.6387 9.7428 63.4823 2.8852 15.3632 31.0454 4.5204 39.0613 13.5153 7.4387 0.9571 27.9556 3.4650 1.7232 8.1623 8.4813 9.4335 85.0908 36.0967 67.6181 35.1324 71.4448 89.4484 64.3921 170.3892 48.1517 45.6799 5.1031 21.0087 146.0452 254.2179 56.5887 117.5600 122.4256 7.9418 17.8818 14.6865 18.1509 12.5181 7.0227 9.2729 4.2192 5.2759 13.1055
temp: 298.150 k
press: 1.00000 atm
elementType: 35 8 7 6 6 6 6 6 6 6 6 6 1 1 1 1 1 1 1 1 1 1
symmnumber: 1
zpe: 447051.4 jmol-1
zpe.correction: 0.170273 hartree
zpe.thermalcorrener: 0.181561 hartree
zpe.thermalcorrenthalpy: 0.182506 hartree
zpe.thermalcorrgfe: 0.130375 hartree
zpe.sumelectzpe: -491.539167 hartree
zpe.sumelectthermal: -491.527879 hartree
zpe.sumelectthermalent: -491.526934 hartree
zpe.sumelectthermalfe: -491.579066 hartree
dipole: 3.2017 4.1675 0.8912
dipole: 5.3304
quadrupole: -78.1266 -77.1039 -80.4772
quadrupole: 13.8887 -10.1833 -1.8494
quadrupole: 0.4426 1.4653 -1.9080 13.8887 -10.1833 -1.8494
hfenergy: -491.7094401 hartree
pointgroup: C01 [X(C9H10Br1N1O1)]
dipole: 1.1192307 1.6736375 0.5867611 debye
dipolederiv: -0.8032743 -0.084626 -0.1895101 -0.1452284 -0.1788496 -0.0472442 -0.7798547 -0.1121449 -0.4816145 -0.6848223 -0.0556581 0.0280599 0.6248898 -0.9187175 0.0609804 -0.0340338 0.0763309 -0.3452221 -2.1603116 0.2351267 0.015832 0.4684965 -0.4003042 -0.0171608 0.1258879 -0.017186 -0.3231388 1.4451363 0.0308539 -0.0482986 0.3145181 0.0730664 -0.0139297 -0.1727075 0.0034375 0.1165625 -0.5706179 -0.0344386 -0.0688271 -0.0322848 -0.1126516 -0.0101819 0.2546031 0.0207863 -0.1254017 -0.493072 0.0162924 -0.0382051 0.2735294 0.0553692 -0.0121785 0.0075224 -0.0266797 -0.1871128 -0.3996334 -0.0613074 -0.0127906 -0.3505982 -0.0994433 -0.0175259 0.0757394 0.0005935 -0.1456096 0.2157274 -0.0168394 -0.001481 0.0772906 0.1125954 0.0179031 -0.0638605 -0.0483227 -0.1233157 0.2366097 0.0500809 -0.0039782 -0.0663823 0.1255265 -0.0650453 -0.0681784 -0.016937 -0.1222833 1.2662349 0.1528188 0.3995813 0.2223097 0.1401851 0.0939271 0.7319651 0.1292582 0.6296765 1.9296488 -0.1491904 -0.0832871 -1.0986746 1.1978425 -0.1006903 -0.0702593 -0.1102919 0.1920206 -0.4360169 -0.1229464 0.0534367 -0.2530007 -0.0981566 0.044273 0.1020226 0.040124 0.0436162 0.0130153 -0.1076501 0.0185665 -0.0974544 -0.0705086 0.0267223 0.0299622 0.0341005 0.1609386 0.1438989 0.0533101 -0.0050017 0.0243317 0.0750781 0.0076911 0.0062602 0.0086018 0.1802475 0.0017165 0.1029611 0.0110405 0.0882401 -0.0137691 0.0124157 -0.0061508 0.0078229 0.1359938 0.0478062 -0.0734212 0.0258455 -0.0698538 -0.0537743 0.0238855 0.006783 0.025419 0.1292693 0.1642664 0.0194002 0.0126729 -0.0165355 0.0969948 0.0295554 0.0151965 0.0214443 0.2963249 -0.0253749 -0.0042602 -0.0372421 0.0763457 -0.0094357 -0.0887748 -0.0694328 -0.0791969 -0.0458211 0.006151 0.0046801 -0.0630937 -0.0848639 -0.0089695 0.065556 -0.0730776 0.055014 -0.0627842 0.0508122 0.0021296 -0.0355517 -0.024191 0.0678394 0.0917575 0.0205746 0.0921719 -0.0575926 -0.0022994 0.0497178 0.0010482 0.1201024 0.0210827 0.0080897 -0.0110566 0.0114364 0.1313575 0.0543992 -0.0070338 0.0211833 -0.0509867 -0.0009998 -0.1100253 -0.027905 -0.1157821 0.0038887 unknown
polarizability: 219.8376964|6.1918841|109.9632537|14.590165|-1.1731991|78.0736957 unknown
InChI: InChI=1S/C9H10BrNO/c1-7(12)11-9-4-2-8(6-10)3-5-9/h2-5,11H,6H2,1H3
charge 0 multiplicity 1
22 atoms
Br -4.61066 -0.473402 -1.25683
O  2.988162 -1.47702 0.046983
N  2.034295 0.664825 -0.109291
C  0.649629 0.392401 0.057713
C  -2.157667 0.000623 0.37801
C  -0.243816 1.499971 0.028372
C  0.132312 -0.918595 0.248548
C  -1.625435 1.303974 0.186441
C  -1.255489 -1.095263 0.403436
C  -3.62216 -0.207137 0.561154
C  3.113603 -0.229655 -0.113508
C  4.466148 0.446449 -0.338915
H  0.148253 2.514869 -0.117898
H  0.818949 -1.76591 0.272948
H  -2.302285 2.165595 0.151404
H  -1.648535 -2.10978 0.540673
H  2.270905 1.650412 -0.249747
H  -4.146548 0.660215 0.985958
H  -3.875599 -1.128311 1.103903
H  4.508936 0.934281 -1.330527
H  5.252634 -0.319764 -0.289989
H  4.668768 1.213921 0.431063
