program: Gaussian 09
title: 000149308
version: EM64L-G09RevD.01
frameworkgroup: C1[X(C22H23NO2)]
method: RPBEPBE
basis: SDD
operation: Freq
keyword: #p
keyword: freq=noraman
keyword: PBEPBE/SDD
title: #p freq=noraman PBEPBE/SDD
converged: YES YES NO NO
title: Mulliken charges:
elementType: O O N C C C C C C C C C C C C C C C C C C C C C C H H H H H H H H H H H H H H H H H H H H H H H
charge: -0.452637 -0.509203 -0.384239 0.011492 0.281079 0.326019 0.247250 -0.713260 -0.615282 0.119242 0.273752 0.182686 0.449315 -0.743145 -0.343698 -0.334402 -0.735754 -0.346720 -0.432063 -0.373834 -0.469437 -0.277215 -0.237263 -0.266310 -0.246261 0.242489 0.244549 0.221120 0.228833 0.290160 0.248118 0.201163 0.189695 0.221969 0.200741 0.216326 0.253350 0.214733 0.240778 0.242267 0.246993 0.241937 0.230273 0.227793 0.222897 0.227808 0.370083 0.365812
chargesum: 0.00000
title: Mulliken charges with hydrogens summed into heavy atoms:
elementType: O O N C C C C C C C C C C C C C C C C C C C C C C
charge: -0.082553 -0.143391 -0.094079 0.011492 0.281079 0.326019 0.247250 -0.226222 -0.165329 0.119242 0.273752 0.182686 0.449315 -0.495027 0.047160 0.088308 -0.051345 -0.105942 -0.189796 -0.126840 -0.227500 -0.046942 -0.009470 -0.043414 -0.018453
polarizability: 2.96882130e+02 -2.32710069e+01 3.85815044e+02 1.11333674e+01 2.24283570e-02 1.30034648e+02
1716.lowfreq: -6.4222 -4.1000 -1.7314 0.0002 0.0004 0.0006 14.8521 30.7478 39.8005
frequency: 14.0674 30.7236 39.7921 60.0083 90.1951 91.4977 107.8636 126.8860 132.1602 159.0882 168.1194 196.6470 200.4132 224.5134 231.1375 259.5588 275.5981 289.5475 308.6738 326.0660 346.9377 348.7372 363.0451 379.2271 416.4277 423.3977 430.6211 447.3536 479.5436 492.2344 494.5539 539.6765 551.6748 559.0684 578.6823 581.5389 604.8715 618.1263 644.7042 676.2050 695.8964 710.4712 733.5215 740.5788 755.4829 773.5164 784.3839 805.4871 829.0430 858.4505 865.5891 869.9293 895.7505 914.1568 934.6161 937.7471 946.8711 952.4600 956.1789 964.8453 973.2289 975.0729 985.8390 986.8405 1001.7387 1008.9478 1029.7967 1034.4380 1056.0328 1089.3379 1096.4299 1123.8012 1135.8166 1137.3227 1150.8710 1161.2726 1171.5515 1176.2214 1178.4325 1189.8212 1195.0014 1213.8520 1225.7450 1237.0272 1256.1885 1257.9016 1278.1082 1286.6724 1303.1271 1328.7064 1345.5991 1356.1954 1381.1775 1385.3485 1396.9529 1398.5346 1416.4433 1419.3414 1432.2461 1438.0916 1444.7907 1453.4686 1457.6313 1460.0067 1463.1931 1471.0762 1473.6138 1480.5885 1510.5846 1531.1381 1583.2353 1586.5457 1615.8278 1618.9356 1640.2523 2919.9549 2937.4013 2961.6758 2979.3377 2984.2240 3009.5649 3022.7939 3028.9047 3035.6068 3074.6216 3114.7179 3118.5144 3121.9798 3122.9596 3131.4039 3135.0933 3152.1457 3155.1041 3166.9838 3171.4600 3396.6754 3481.8345 3600.9933
redmass: 4.0265 5.6775 4.3270 4.8856 4.7434 3.9544 3.3829 3.9397 3.7106 2.1393 2.9269 4.5101 1.6516 2.6281 1.1436 2.5996 4.5330 3.1694 4.7986 3.7144 3.0346 3.0662 2.8737 3.9670 2.5375 2.5855 2.6437 3.0214 4.9113 2.1490 3.1748 4.6330 3.2224 4.5958 3.4963 3.7526 5.7997 1.2520 3.9147 4.0513 5.5036 4.0547 1.8309 2.7443 1.3805 1.9877 3.8009 2.8511 4.0540 1.4977 1.3708 4.7688 1.6732 1.7867 1.7016 1.4996 1.6957 2.1603 1.7874 3.0819 1.9225 2.7885 1.3468 1.3678 6.0367 2.7352 3.4454 2.1096 2.2830 3.3351 2.4069 1.8509 1.5817 1.1463 1.5427 1.4787 1.1249 1.1000 1.2402 1.5694 1.6581 1.5804 1.4232 2.1885 2.4893 2.0658 1.6540 2.0156 1.6847 1.2569 2.0132 1.6562 1.3231 4.4141 1.2886 2.7833 1.2033 3.6683 1.3495 2.5024 3.0224 1.2028 2.8121 1.0837 1.0753 3.0690 1.0765 1.0890 3.5554 1.1298 7.6403 6.9550 6.4383 6.7767 7.8175 1.0672 1.0691 1.0572 1.0608 1.0376 1.0879 1.0995 1.0974 1.1039 1.1000 1.0974 1.0873 1.0908 1.0866 1.0891 1.0900 1.0948 1.0954 1.0979 1.0967 1.0655 1.0761 1.0670
irintensity: 2.3557 0.5215 0.1451 0.0946 0.9153 0.5524 4.1750 0.7404 0.8920 5.5896 0.3056 0.4894 9.4707 21.7924 112.7080 7.4444 4.8555 1.1019 0.3387 2.1304 4.9472 1.4248 5.9232 3.2265 6.6745 14.2489 7.5061 5.7511 1.5506 62.9564 1.2090 3.6420 3.0984 9.0243 8.3483 1.5263 1.7387 132.0317 25.6111 2.1627 1.9534 11.5042 22.9911 18.9790 32.1305 82.7367 0.3599 1.0614 1.1458 6.1710 0.0584 0.4824 9.2763 1.7661 0.8630 2.8345 0.2838 20.2555 15.2630 44.0879 13.5908 6.4384 0.8185 3.0404 158.8914 7.8628 1.6941 7.9473 2.4712 11.2106 0.0131 8.1986 95.5235 0.4196 0.9880 18.8000 0.8419 0.8368 0.7905 4.2967 13.0634 1.6538 4.0433 5.2600 3.5843 17.0534 16.6777 0.8688 2.2572 6.9506 16.5618 2.8239 17.5350 4.2759 14.3851 4.9559 65.6162 5.7976 8.1702 25.3227 2.1811 21.4855 3.8065 5.6547 1.0044 3.4837 13.1791 9.0515 14.4888 18.8638 0.1658 0.4303 0.2540 1.7592 0.7689 32.9740 99.6544 72.2396 18.3439 17.6075 23.3706 8.0231 50.5586 51.7151 30.1994 13.8722 0.2811 11.9937 6.3465 13.9387 12.3458 38.4793 37.2596 32.0195 17.2863 114.0118 1.4564 8.5901
temp: 298.150 k
press: 1.00000 atm
elementType: 8 8 7 6 6 6 6 6 6 6 6 6 6 6 6 6 6 6 6 6 6 6 6 6 6 1 1 1 1 1 1 1 1 1 1 1 1 1 1 1 1 1 1 1 1 1 1 1
symmnumber: 1
zpe: 1035153.0 jmol-1
zpe.correction: 0.394269 hartree
zpe.thermalcorrener: 0.416638 hartree
zpe.thermalcorrenthalpy: 0.417582 hartree
zpe.thermalcorrgfe: 0.342248 hartree
zpe.sumelectzpe: -1055.546122 hartree
zpe.sumelectthermal: -1055.523753 hartree
zpe.sumelectthermalent: -1055.522808 hartree
zpe.sumelectthermalfe: -1055.598143 hartree
dipole: 1.6588 2.8037 0.3741
dipole: 3.2791
quadrupole: -133.7624 -139.4075 -153.4187
quadrupole: -22.1205 2.5932 -3.8291
quadrupole: 8.4338 2.7887 -11.2225 -22.1205 2.5932 -3.8291
hfenergy: -1055.9403905 hartree
pointgroup: C01 [X(C22H23N1O2)]
dipole: -0.9611748 0.8494914 -0.1373909 debye
polarizability: 291.3061449|-8.0810675|390.4810265|13.2320854|11.6244097|130.9446496 unknown
InChI: InChI=1S/C22H23NO2/c1-22(13-24,14-25)23-12-20-18-8-4-2-6-15(18)10-17-11-16-7-3-5-9-19(16)21(17)20/h2-10,23-25H,11-14H2,1H3
charge 0 multiplicity 1
48 atoms
O  5.291614 -0.462396 0.745108
O  5.034181 2.182656 0.388068
N  1.789789 0.541505 -0.474812
C  -1.301905 -0.705283 0.107193
C  -0.552224 0.46437 0.33616
C  -2.730294 -0.633561 -0.131266
C  3.271295 0.614811 -0.337643
C  -3.313251 -2.03032 -0.284881
C  0.921167 0.399107 0.719986
C  -0.912832 -2.139972 0.0537
C  -2.089675 -2.924692 -0.164612
C  -1.221885 1.744586 0.235056
C  -2.652502 1.801995 -0.012429
C  -3.39156 0.582733 -0.175485
C  3.833101 -0.388606 0.726082
C  3.5885 2.077741 0.077491
C  3.888872 0.316403 -1.720683
C  0.345254 -2.790467 0.130541
C  -2.023747 -4.324849 -0.267564
C  -0.513099 2.988112 0.360033
C  -3.305836 3.075554 -0.086488
C  0.408744 -4.198509 0.02621
C  -0.765499 -4.966328 -0.163679
C  -1.174817 4.21552 0.276107
C  -2.587145 4.263549 0.059195
H  -3.825928 -2.164166 -1.257553
H  -4.064479 -2.247791 0.500074
H  1.154537 1.218258 1.425086
H  1.093468 -0.537917 1.292124
H  1.490785 -0.055966 -1.253571
H  -4.474556 0.633903 -0.341352
H  3.48507 -1.409168 0.478497
H  3.443838 -0.120302 1.734368
H  3.319172 2.752129 -0.75798
H  2.997479 2.350885 0.976626
H  3.722478 -0.740534 -2.000818
H  4.975859 0.491204 -1.705292
H  3.429634 0.966453 -2.488328
H  1.274286 -2.227628 0.252657
H  -2.932684 -4.915001 -0.432841
H  0.573099 2.970689 0.48528
H  -4.387593 3.101064 -0.265611
H  1.380896 -4.700227 0.08796
H  -0.697348 -6.057045 -0.241986
H  -0.609901 5.150115 0.366889
H  -3.097189 5.231215 -0.001203
H  5.610269 0.485319 0.76606
H  5.265763 3.101455 0.66493
