program: Gaussian 09
title: 000149320
version: EM64L-G09RevD.01
frameworkgroup: C1[X(C21H21NO2)]
method: RPBEPBE
basis: SDD
operation: Freq
keyword: #p
keyword: freq=noraman
keyword: PBEPBE/SDD
title: #p freq=noraman PBEPBE/SDD
converged: YES YES NO NO
title: Mulliken charges:
elementType: O O N C C C C C C C C C C C C C C C C C C C C C H H H H H H H H H H H H H H H H H H H H H
charge: -0.458934 -0.454572 -0.354933 0.257715 0.277157 0.108826 -0.598376 -0.493468 0.209715 0.339709 0.346754 0.434825 -0.389514 -0.335349 -0.766202 -0.441789 -0.420506 -0.409289 -0.381151 -0.444026 -0.426290 -0.228468 -0.274393 -0.256650 0.236094 0.221820 0.272413 0.204962 0.235722 0.219583 0.183951 0.202505 0.238045 0.249448 0.249182 0.252635 0.230258 0.280470 0.249111 0.236395 0.221780 0.231116 0.230942 0.356639 0.356139
chargesum: 0.00000
title: Mulliken charges with hydrogens summed into heavy atoms:
elementType: O O N C C C C C C C C C C C C C C C C C C C C C
charge: -0.102295 -0.098433 -0.082521 0.257715 0.277157 0.108826 -0.140463 -0.493468 0.209715 0.339709 0.346754 0.434825 0.051170 0.068184 -0.076205 -0.192606 -0.167871 -0.179031 -0.100680 -0.194915 -0.189896 -0.006688 -0.043277 -0.025708
polarizability: 3.38194696e+02 -2.96108791e+01 3.13992315e+02 1.60114553e+01 2.77693722e+00 1.26254998e+02
1716.lowfreq: -12.1017 -6.4536 -4.7344 -0.0008 -0.0005 -0.0003 0.5478 24.0490 37.4411
frequency: -4.8736 23.8632 37.3422 84.5187 92.5127 108.9963 120.3152 124.1815 156.0145 172.3978 214.9724 219.6010 243.0938 250.1938 261.3995 264.7249 276.9592 301.1340 329.5284 342.6115 372.6297 389.5969 407.4807 419.6113 428.2783 442.6557 452.7980 459.8295 518.6999 535.2367 550.1465 580.4911 594.8355 604.0271 619.9819 631.6803 644.0107 658.3020 681.4805 725.1247 740.4576 748.2404 767.2843 784.9492 786.5867 809.6344 819.7973 851.6047 892.0760 902.0486 910.1785 914.8753 917.9472 928.6601 939.0692 956.4961 957.0409 969.5906 977.5804 989.2986 990.5502 1003.6735 1021.0487 1044.2085 1048.9764 1060.6533 1070.3623 1084.1923 1107.2625 1110.1091 1144.5731 1154.1609 1173.1235 1180.5633 1194.5647 1195.3028 1229.8621 1243.8892 1259.1571 1267.5872 1281.3258 1305.7745 1320.9344 1327.1371 1334.5376 1343.3952 1346.5309 1368.9125 1376.1598 1384.0924 1405.5007 1412.4384 1437.8921 1451.6176 1454.6490 1457.8405 1464.9293 1469.0041 1471.6631 1473.4601 1490.6153 1490.7793 1500.0230 1539.4827 1608.2614 1614.7738 1620.8950 1629.3936 2916.4573 2932.3966 2965.1319 2972.9466 3007.3891 3064.5872 3069.8526 3075.8898 3092.0641 3125.6622 3128.7097 3139.5532 3144.0048 3157.2089 3160.1611 3172.5189 3174.2320 3198.8915 3395.1216 3463.9053 3575.1505
redmass: 4.6390 4.7841 4.8941 3.8763 3.9726 4.1392 4.8593 3.2115 4.7775 3.3617 1.1838 3.1747 4.7715 2.4758 4.4836 4.5895 2.6535 3.5243 1.3613 1.8099 4.5082 6.2773 3.2772 2.3970 4.5689 3.0681 3.1134 4.3996 2.1030 5.1696 2.6754 3.1385 4.5353 4.7244 3.3741 2.8227 1.4665 5.2713 3.6665 3.5354 2.0122 2.9662 1.3265 2.1381 1.6926 5.4968 3.3875 2.1327 2.1522 1.7425 4.5792 1.4759 2.0508 1.4271 1.8556 3.3718 1.4395 1.9248 1.3744 1.4878 2.6390 5.2095 2.4523 2.1787 2.2149 2.4148 2.3405 1.5770 1.6602 2.0761 1.4067 1.5918 2.4561 1.1458 1.2739 1.2998 1.7650 1.9411 2.4861 1.9042 1.7664 1.2534 2.4990 1.9848 1.3216 3.3676 1.3940 1.1834 6.2389 1.2670 1.1713 3.1344 2.9115 3.5173 1.1625 1.0813 1.1158 4.2725 3.0791 1.0847 4.0977 1.0898 1.0945 4.6207 7.5795 6.2604 8.8052 8.7096 1.0691 1.0691 1.0644 1.0399 1.0885 1.0946 1.0964 1.0985 1.0989 1.0856 1.0854 1.0914 1.0905 1.0973 1.0967 1.0884 1.0968 1.1045 1.0660 1.0755 1.0658
irintensity: 1.2398 1.4308 0.0745 0.6125 1.3778 2.2472 3.1102 4.7726 3.5348 3.4099 5.6889 2.4613 5.0260 0.4667 22.3774 1.0661 1.2932 0.8647 100.7712 55.7853 5.0883 0.2884 4.2705 4.2211 0.8146 11.8270 18.9854 6.9383 63.3122 2.9592 14.8765 8.3098 5.0473 1.0009 8.4148 20.9633 130.1006 6.7276 1.3556 7.8041 9.5321 9.2487 166.4466 0.9511 2.7048 1.5360 2.4500 25.6881 3.8837 24.4595 0.3556 0.8540 2.8596 3.6645 4.0327 56.2294 5.2200 1.6583 1.6733 2.7536 36.5392 145.9607 0.6822 3.0778 3.7847 5.6991 24.2655 18.0530 4.2438 8.5974 7.5869 1.2616 102.8716 1.9191 12.6461 1.0694 2.6554 1.4212 13.7776 5.7100 1.5728 8.1439 4.0623 4.4977 31.1905 10.4491 2.8104 6.0430 4.4163 28.7387 40.6534 10.3338 31.8735 0.6124 19.9174 2.8656 14.0902 35.0783 8.4172 2.0058 0.2131 20.3742 18.0964 14.3670 6.8599 6.7383 18.1669 2.2530 41.4565 99.7064 44.4454 29.5749 22.3442 18.0599 30.0209 25.7157 17.6935 1.5707 2.5854 18.5149 1.9164 23.7261 51.6852 0.7477 18.7713 20.4045 92.1788 1.4419 16.9317
temp: 298.150 k
press: 1.00000 atm
elementType: 8 8 7 6 6 6 6 6 6 6 6 6 6 6 6 6 6 6 6 6 6 6 6 6 1 1 1 1 1 1 1 1 1 1 1 1 1 1 1 1 1 1 1 1 1
symmnumber: 1
zpe: 961811.6 jmol-1
zpe.correction: 0.366335 hartree
zpe.thermalcorrener: 0.386460 hartree
zpe.thermalcorrenthalpy: 0.387405 hartree
zpe.thermalcorrgfe: 0.318365 hartree
zpe.sumelectzpe: -1016.310208 hartree
zpe.sumelectthermal: -1016.290083 hartree
zpe.sumelectthermalent: -1016.289139 hartree
zpe.sumelectthermalfe: -1016.358179 hartree
dipole: 1.7668 -1.8829 1.9180
dipole: 3.2164
quadrupole: -145.0459 -129.7756 -145.1028
quadrupole: 12.1737 -7.8469 -2.2068
quadrupole: -5.0711 10.1992 -5.1281 12.1737 -7.8469 -2.2068
hfenergy: -1016.6765431 hartree
pointgroup: C01 [X(C21H21N1O2)]
dipole: 0.6643471 -0.8070002 0.7132686 debye
polarizability: 335.9449757|-31.3568604|315.087079|15.8650924|13.1684674|127.4099539 unknown
InChI: InChI=1S/C21H21NO2/c1-21(12-23,13-24)22-11-19-16-7-3-2-6-15(16)17-8-4-5-14-9-10-18(19)20(14)17/h2-10,22-24H,11-13H2,1H3
charge 0 multiplicity 1
45 atoms
O  -5.696434 -1.681459 -0.347396
O  -5.755125 1.087302 -0.515595
N  -2.283626 -0.104843 0.468409
C  -3.768752 -0.177076 0.395419
C  0.027093 -0.162047 -0.419196
C  0.887296 -1.25808 -0.3807
C  -1.450666 -0.352811 -0.736158
C  2.290103 -1.051752 -0.108593
C  0.592057 1.170718 -0.167897
C  2.896358 0.194256 0.116823
C  2.012154 1.363231 0.08387
C  2.975353 -2.305004 -0.120787
C  -4.223048 -1.533678 -0.240561
C  -4.294999 1.01841 -0.45871
C  -4.308183 -0.057464 1.837979
C  0.718767 -2.71698 -0.56534
C  1.953494 -3.334961 -0.408963
C  4.311081 0.169183 0.353922
C  -0.255257 2.323524 -0.17894
C  4.359533 -2.310109 0.114189
C  2.502963 2.684966 0.286887
C  5.00921 -1.055709 0.351087
C  0.256881 3.611937 0.023623
C  1.647737 3.796032 0.25474
H  -1.753853 0.3591 -1.52721
H  -1.577755 -1.371404 -1.16496
H  -1.905687 -0.574474 1.300242
H  -3.791876 -2.377882 0.338097
H  -3.879079 -1.606998 -1.286247
H  -3.962437 1.962136 0.005695
H  -3.872377 0.959785 -1.486315
H  -4.084232 -0.965258 2.432763
H  -5.397796 0.119439 1.835171
H  -3.834655 0.807193 2.335248
H  -0.221463 -3.225383 -0.787473
H  2.147907 -4.406998 -0.48643
H  4.866514 1.094418 0.5399
H  -1.330713 2.182971 -0.313094
H  4.943759 -3.23711 0.117867
H  3.571618 2.837316 0.470273
H  6.089557 -1.04829 0.535592
H  -0.414824 4.477054 0.010933
H  2.049229 4.803055 0.412343
H  -6.072292 -1.834718 0.555934
H  -6.084138 0.169766 -0.73874
