program: Gaussian 09
title: 000149362
version: EM64L-G09RevD.01
frameworkgroup: C1[X(C20H25N7O4)]
method: RPBEPBE
basis: SDD
operation: Freq
keyword: #p
keyword: freq=noraman
keyword: PBEPBE/SDD
title: #p freq=noraman PBEPBE/SDD
converged: YES YES NO NO
title: Mulliken charges:
elementType: O O O O N N N N N N N C C C C C C C C C C C C C C C C C C C C H H H H H H H H H H H H H H H H H H H H H H H H H
charge: -0.239157 -0.492156 -0.453958 -0.262607 -0.222968 -0.355597 -0.085034 -0.109414 -0.115065 -0.345716 -0.625505 -0.184463 -0.092208 -0.172773 -0.182675 0.218810 0.175893 -0.229366 -0.153754 0.164695 -0.335831 0.001576 -0.652829 -0.325472 -0.617674 0.489355 -0.405906 -0.408800 -0.229840 -0.228487 -0.242085 0.294869 0.280340 0.279324 0.254114 0.379349 0.375864 0.342063 0.328479 0.218426 0.256940 0.322757 0.219755 0.206563 0.234085 0.226537 0.236281 0.345370 0.322856 0.225433 0.217923 0.233929 0.235134 0.226261 0.226733 0.229629
chargesum: 0.00000
title: Mulliken charges with hydrogens summed into heavy atoms:
elementType: O O O O N N N N N N N C C C C C C C C C C C C C C C C C C C C
charge: -0.239157 -0.112807 -0.078094 -0.262607 -0.222968 -0.027119 -0.085034 -0.109414 -0.115065 -0.022959 0.042721 0.110406 0.188132 0.106552 0.071439 0.218810 0.175893 0.112697 -0.153754 0.164695 0.139535 0.001576 0.007573 0.137346 -0.174318 0.489355 -0.171977 -0.173667 -0.003579 -0.001754 -0.012457
polarizability: 3.36814051e+02 1.80955432e+01 3.19979524e+02 -1.91949433e+00 -6.25116618e+00 1.94752634e+02
1716.lowfreq: -6.8369 -5.1669 -2.7462 0.0004 0.0006 0.0009 6.6068 11.4488 15.8286
frequency: 4.7879 11.2740 15.7337 21.0543 27.2767 29.1941 39.4214 46.5077 57.9770 67.7126 82.6811 93.0680 110.8702 115.4938 129.9904 155.2980 174.4188 199.5501 209.1536 234.7815 249.1083 258.3222 261.3222 267.7122 282.5195 290.4086 303.5155 312.7456 332.2322 338.0571 341.9451 363.0497 381.0009 402.7635 415.5471 434.1892 455.1782 491.2011 494.0745 516.0223 542.8437 545.3961 562.9856 569.5587 615.0956 617.5013 621.2594 630.0760 634.8188 637.8711 658.2801 666.2527 675.9273 706.2503 711.7036 729.8394 751.8696 761.5021 772.8111 784.4278 785.2406 807.3091 813.3777 829.0316 855.0259 857.8997 871.2551 877.2927 911.0634 919.3240 926.2444 948.3109 976.6827 983.0174 990.0244 995.5557 1007.7296 1012.5406 1022.3158 1026.4080 1037.8875 1039.6573 1051.9974 1055.3677 1062.7757 1083.7117 1094.8075 1108.6006 1135.4960 1148.3187 1160.0943 1172.4019 1174.8102 1187.4049 1191.3220 1192.1969 1199.0557 1216.9166 1221.9344 1229.2526 1243.6138 1266.6835 1267.2089 1275.0670 1282.0512 1288.2478 1295.1245 1306.7815 1312.3068 1327.6811 1327.7704 1334.4702 1349.6718 1354.8880 1376.5654 1382.9334 1384.3497 1389.3848 1390.1759 1401.4076 1440.6762 1451.5081 1461.3865 1470.2848 1473.9793 1480.1296 1482.4780 1484.8648 1500.2569 1513.9327 1536.7088 1566.9260 1575.9726 1593.8586 1615.0135 1628.3598 1632.5444 2962.1421 2981.0154 2982.9231 2991.1361 3005.8497 3010.8525 3040.1467 3045.4584 3058.9901 3066.2719 3075.9147 3085.0968 3097.4724 3115.5218 3116.7548 3132.5806 3144.6921 3163.0539 3208.3796 3442.3726 3491.0219 3543.3846 3578.7773 3608.0957 3699.0787
redmass: 4.4038 4.1841 4.9479 5.3456 2.8871 3.3489 4.7597 5.1346 5.7923 5.4622 3.8656 4.6082 3.9800 4.8803 5.5265 4.8430 4.9599 5.3634 1.5885 6.0778 4.2914 4.0594 4.6721 3.3147 4.6514 3.0668 2.4156 1.7253 5.5339 2.9874 4.3939 5.6369 5.3700 2.8244 3.6076 3.8596 1.1152 4.8871 1.2319 4.4904 1.3228 1.0625 3.2426 4.8489 5.9035 6.3622 3.6847 4.5420 4.0471 1.8246 9.6458 3.2667 6.3055 1.7626 10.9555 3.6726 3.7051 2.0622 4.4312 2.6307 1.7137 1.8073 4.1865 6.3664 1.2471 3.5561 1.3383 2.1983 3.2195 1.4424 3.4441 3.9487 1.3861 3.1667 6.2515 1.3146 4.0699 4.8783 1.6070 2.2174 4.2660 4.5641 3.4434 3.1669 3.7146 2.5961 1.4710 2.4498 3.1897 1.7819 1.2628 1.0536 3.1159 1.1199 1.8128 1.2142 1.4107 2.2958 2.1469 2.0515 2.1064 1.2512 1.2184 2.7070 1.1397 2.6344 1.2941 2.1973 1.4469 1.2573 1.4114 1.4297 1.6141 1.3219 1.5875 7.9457 3.3720 1.3780 1.2224 2.2633 2.1745 3.1231 4.0979 1.0575 1.0542 1.2168 1.0760 1.9639 1.0913 1.7346 4.0656 3.5300 3.5251 6.0620 6.1762 2.5318 5.7238 1.0620 1.0602 1.0361 1.0661 1.0842 1.0976 1.0873 1.1040 1.0881 1.0978 1.0881 1.0975 1.1016 1.0873 1.0872 1.0907 1.0958 1.1015 1.1028 1.0643 1.0782 1.0441 1.0771 1.0670 1.1056
irintensity: 0.3196 0.2378 0.9710 0.3527 0.4287 0.5195 0.7069 3.7240 6.0648 5.2786 2.1994 1.3590 6.3024 3.5280 2.5783 2.5137 0.6988 1.7124 2.0525 1.9339 6.6922 10.5033 13.5142 4.4518 9.7258 5.1161 42.5958 67.9762 1.8171 0.2313 7.3467 3.9018 7.7943 0.0018 3.9640 2.2315 34.9332 8.7319 307.4322 16.1523 60.0171 16.2766 20.1580 9.3021 13.7217 0.2046 38.6334 23.8668 26.9840 101.7797 4.3037 31.4374 3.5914 54.7189 9.9103 20.4662 20.1108 46.2519 12.2808 15.4960 5.6008 10.8967 19.2125 7.5898 0.0759 28.6677 29.5814 2.0500 9.1237 3.9859 43.4311 3.8412 0.0162 7.5349 0.2364 0.2370 66.4401 25.4300 1.5120 5.8451 85.7786 64.0809 13.3107 24.6754 80.7116 20.1977 9.2993 21.2234 20.0355 27.3616 25.8383 0.0661 27.8267 1.8104 50.3123 4.7378 134.2594 12.0517 56.7259 52.8898 60.8420 31.5453 8.2121 23.6542 42.4404 4.4977 4.3791 15.2020 7.3712 0.2701 11.9202 15.4209 50.2311 3.1160 54.6768 0.0956 96.7182 72.4581 11.0398 25.1489 7.4830 85.8844 194.0907 36.3618 7.3130 25.0363 19.5049 14.9444 51.1741 234.3300 565.4893 308.1975 273.8890 1.2864 2.2090 673.9839 73.8297 32.4971 41.6941 31.8100 41.9611 29.1514 8.1417 14.4620 35.0374 3.3502 8.0255 16.6232 37.1012 32.8663 8.6156 7.6782 10.4484 41.2606 22.9333 95.3642 51.1228 29.0322 119.0311 69.3874 26.0505 46.2210
temp: 298.150 k
press: 1.00000 atm
elementType: 8 8 8 8 7 7 7 7 7 7 7 6 6 6 6 6 6 6 6 6 6 6 6 6 6 6 6 6 6 6 6 1 1 1 1 1 1 1 1 1 1 1 1 1 1 1 1 1 1 1 1 1 1 1 1 1
symmnumber: 1
zpe: 1169381.6 jmol-1
zpe.correction: 0.445394 hartree
zpe.thermalcorrener: 0.475072 hartree
zpe.thermalcorrenthalpy: 0.476016 hartree
zpe.thermalcorrgfe: 0.377818 hartree
zpe.sumelectzpe: -1459.021983 hartree
zpe.sumelectthermal: -1458.992305 hartree
zpe.sumelectthermalent: -1458.991361 hartree
zpe.sumelectthermalfe: -1459.089559 hartree
dipole: -3.1264 -3.4088 -2.2223
dipole: 5.1315
quadrupole: -169.6522 -163.3024 -182.8933
quadrupole: -13.5654 -12.2348 -5.7988
quadrupole: 2.2971 8.6469 -10.9440 -13.5654 -12.2348 -5.7988
hfenergy: -1459.4673768 hartree
pointgroup: C01 [X(C20H25N7O4)]
dipole: -1.1809842 1.3628722 0.9076359 debye
polarizability: 336.2448158|-18.5421435|320.4689791|-2.7028901|-6.195316|194.8324141 unknown
InChI: InChI=1S/C20H25N7O4/c1-2-22-18(30)15-13(28)14(29)19(31-15)27-10-24-12-16(21)25-20(26-17(12)27)23-9-8-11-6-4-3-5-7-11/h3-7,10,13-15,19,22-23,28-29H,2,8-9,21H2,1H3
charge 0 multiplicity 1
56 atoms
O  2.764004 0.556353 -1.780491
O  0.702119 2.472977 -0.463024
O  2.779533 2.761287 1.136647
O  5.28648 -0.357979 -0.932533
N  1.461879 -1.191429 -0.77513
N  5.684514 1.632565 0.235373
N  2.117407 -3.354714 -0.402285
N  -0.934334 -1.359503 -0.160105
N  -1.530454 -3.661115 0.537628
N  -3.118963 -1.95591 0.490894
N  0.039203 -5.423683 0.602667
C  1.218986 1.171373 -0.022708
C  1.463067 0.21743 -1.220448
C  2.654084 1.468555 0.485895
C  3.515953 1.379436 -0.817947
C  4.912488 0.785097 -0.537072
C  0.319721 -1.869017 -0.338953
C  2.519576 -2.135642 -0.804109
C  0.746215 -3.200507 -0.112791
C  -0.254735 -4.109126 0.347796
C  7.047765 1.291696 0.682191
C  -1.809266 -2.330537 0.278244
C  8.106269 2.274945 0.14274
C  -3.611695 -0.591534 0.288546
C  -5.145778 -0.534656 0.49432
C  -5.675574 0.878811 0.303604
C  -5.701692 1.794586 1.386997
C  -6.110765 1.325094 -0.970723
C  -6.150249 3.122134 1.203513
C  -6.560361 2.651749 -1.159587
C  -6.580693 3.555691 -0.072127
H  0.55944 0.713784 0.733715
H  0.698559 0.342664 -2.007751
H  2.967972 0.712042 1.22271
H  3.617211 2.396167 -1.244662
H  -0.276074 2.426045 -0.59222
H  2.095137 3.348709 0.707363
H  3.523786 -1.845689 -1.113283
H  5.254733 2.500622 0.573863
H  7.075166 1.269073 1.789257
H  7.245024 0.268573 0.319798
H  -3.740502 -2.688597 0.833011
H  9.111422 1.983637 0.498389
H  7.912737 3.308577 0.485296
H  8.11399 2.271272 -0.960974
H  -3.112887 0.10812 0.990597
H  -3.351846 -0.24814 -0.731407
H  0.988761 -5.759089 0.45536
H  -0.696015 -6.048421 0.92444
H  -5.627434 -1.22669 -0.223203
H  -5.383562 -0.897369 1.513993
H  -5.376321 1.462297 2.381041
H  -6.102644 0.627076 -1.817405
H  -6.169825 3.814466 2.052917
H  -6.898518 2.977844 -2.149747
H  -6.933013 4.583299 -0.215523
