program: Gaussian 09
title: 000149287
version: EM64L-G09RevD.01
frameworkgroup: C1[X(C10H7IO3)]
method: RPBEPBE
basis: SDD
operation: Freq
keyword: #p
keyword: freq=noraman
keyword: PBEPBE/SDD
title: #p freq=noraman PBEPBE/SDD
converged: NO YES NO YES
title: Mulliken charges:
elementType: I O O O C C C C C C C C C C H H H H H H H
charge: 0.182621 -0.247396 -0.247402 -0.187602 0.405346 0.351549 -0.726538 -0.410652 0.498569 -0.369916 -0.245620 -0.310289 0.130983 -0.534680 0.240285 0.253117 0.246809 0.255628 0.256942 0.229124 0.229123
chargesum: 0.00000
title: Mulliken charges with hydrogens summed into heavy atoms:
elementType: I O O O C C C C C C C C C C
charge: 0.182621 -0.247396 -0.247402 -0.187602 0.405346 0.351549 -0.726538 -0.170367 0.498569 -0.116799 0.001189 -0.054661 0.130983 0.180509
polarizability: 2.20292754e+02 1.61736197e+01 1.80190217e+02 6.59227067e-03 -1.31058224e-02 5.38164059e+01
1716.lowfreq: -7.6997 -3.7950 -0.0004 0.0002 0.0005 5.7692 53.1152 87.6490 105.3371
frequency: 53.1080 87.6427 105.3363 123.3411 129.3734 155.6125 221.9985 260.9803 274.7741 293.6712 305.6483 379.0389 416.2857 447.9750 485.0470 515.9483 558.0838 610.7460 618.6378 677.5383 686.0719 716.8440 769.4970 776.6795 796.1497 840.6409 861.2667 927.0024 935.3661 983.1484 1033.6447 1048.8792 1108.9039 1126.7177 1148.0535 1177.1444 1226.5192 1249.7071 1262.7232 1377.1901 1392.3207 1411.2753 1434.5104 1466.8254 1470.8285 1477.9170 1524.8663 1599.9821 1617.7202 1693.8474 2973.5029 3068.7634 3134.3702 3139.5465 3141.2972 3178.9655 3190.3739
redmass: 5.6687 4.2189 14.7341 5.7003 5.3747 5.4086 1.2583 9.1723 3.4957 5.9415 4.5334 8.1249 3.7024 8.7350 5.9348 3.9791 5.1588 9.3844 4.2777 3.6400 5.9774 8.4734 5.4585 7.6525 1.5747 1.5953 8.2814 7.6302 1.3562 1.3297 5.6352 3.7256 1.2551 2.1211 1.5124 1.2059 1.7265 1.7578 4.0684 6.3179 1.7987 7.1885 1.2440 1.2947 1.0503 2.2118 6.8612 6.8671 7.5667 11.0251 1.0322 1.1049 1.0907 1.0986 1.0913 1.0941 1.0955
irintensity: 0.5564 11.9510 1.2525 1.2129 0.4630 1.0402 0.3322 0.2144 2.7818 0.0716 1.4558 6.7832 0.1532 1.0459 0.3587 0.0689 37.8809 22.3848 5.0102 1.8309 2.5261 35.5826 21.4482 1.8855 18.4950 78.8284 49.0704 8.2782 1.6407 0.2196 186.4466 20.2284 0.0620 71.5503 5.6885 1.6210 77.1784 39.1832 187.3979 25.4530 49.5887 8.0670 2.1806 83.4949 15.6991 2.0858 77.4229 137.5519 293.1896 450.6831 68.4932 38.5441 9.4348 19.8119 2.6646 9.4266 2.1182
temp: 298.150 k
press: 1.00000 atm
elementType: 53 8 8 8 6 6 6 6 6 6 6 6 6 6 1 1 1 1 1 1 1
symmnumber: 1
zpe: 380949.9 jmol-1
zpe.correction: 0.145096 hartree
zpe.thermalcorrener: 0.157476 hartree
zpe.thermalcorrenthalpy: 0.158420 hartree
zpe.thermalcorrgfe: 0.104817 hartree
zpe.sumelectzpe: -621.433471 hartree
zpe.sumelectthermal: -621.421091 hartree
zpe.sumelectthermalent: -621.420147 hartree
zpe.sumelectthermalfe: -621.473751 hartree
dipole: 2.7748 7.7671 -0.0009
dipole: 8.2479
quadrupole: -86.8033 -82.9123 -97.4349
quadrupole: -7.5345 0.0030 0.0022
quadrupole: 2.2469 6.1379 -8.3847 -7.5345 0.0030 0.0022
hfenergy: -621.5785676 hartree
pointgroup: C01 [X(C10H7I1O3)]
dipole: 2.069631 -2.4992779 -0.000128 debye
dipolederiv: 0.1096568 -0.0469024 -0.0000037 -0.0904962 -0.3262038 0.0000391 -0.0001896 -0.000348 0.0695003 -1.423522 0.1400734 -0.0001466 0.0293299 -0.2611605 -0.0001204 -0.0000525 -0.0001739 -0.1926033 -1.9603126 0.0039474 -0.0001081 -0.5067064 -0.2231308 -0.0000456 -0.0001895 -0.0001388 -0.2768431 -1.2119792 0.279855 0.000197 0.811464 -0.6888079 -0.0002119 -0.0004504 0.0000233 -0.3285063 -0.8197633 -0.0759073 -0.0000402 -0.1943238 -0.2163717 0.0000161 -0.0001886 -0.000102 -0.0044152 0.894268 -0.0199081 0.0000264 -0.1649387 -0.0626392 -0.0000617 0.0001481 0.000164 0.1815448 -0.7482842 0.0895161 0.0000468 0.2995881 0.8947081 0.0001693 0.000228 0.0004409 -0.2422693 0.6130108 -0.0513808 0.000028 -0.0820866 0.0799616 0.000033 0.0000034 0.0000518 -0.1291649 1.4972483 -0.0013914 0.0000119 0.898939 -0.0824795 0.0001115 0.0002402 0.0001066 0.1602231 -0.4413784 0.0746999 0.0000155 -0.6372957 -0.1183184 -0.0001448 -0.0002034 -0.0001489 -0.2036997 1.0574495 0.0055596 0.0000345 0.0478099 0.2132322 0.0000945 0.0001439 0.0000114 -0.0682448 -0.4587017 0.0688448 0.0000091 0.7514537 -0.3948626 -0.000005 0.0001331 -0.00017 -0.1950868 1.8917373 -0.2759375 -0.0000275 -0.9765039 1.0230624 0.0003313 0.0002568 0.0001872 0.283222 0.9511311 -0.1056819 0.0000102 -0.3781429 0.2545855 -0.0000324 -0.000061 -0.0001109 0.3141437 0.0794527 -0.0514006 -0.0000061 -0.0073762 -0.0834715 -0.0000482 0.0000333 0.0000407 0.1564671 -0.0393457 0.0776008 -0.0000195 0.0727146 0.0207339 -0.0000192 0.0000224 0.0000014 0.1721816 0.0881643 0.0105138 -0.0000156 -0.0578243 -0.0901124 -0.0000862 0.0000784 0.000041 0.1405963 -0.0138403 -0.05711 -0.0000018 -0.0245911 0.0613785 -0.0000286 -0.0000115 -0.0000222 0.1827663 -0.0667221 -0.0561585 -0.000028 -0.1300091 0.0202589 -0.0000293 -0.0000352 -0.0000147 0.128764 0.0008588 -0.0044254 -0.0306438 0.1695053 -0.0100837 -0.112673 0.0376512 -0.0982778 -0.0743331 0.000872 -0.0044069 0.0306614 0.1694906 -0.0102792 0.1127112 -0.037557 0.098439 -0.0742429 unknown
polarizability: 225.9983824|0.4707179|174.4845878|0.0111314|0.0152938|53.8164068 unknown
InChI: InChI=1S/C10H7IO3/c1-13-7-4-2-6-3-5-8(12)14-10(6)9(7)11/h2-5H,1H3
charge 0 multiplicity 1
21 atoms
I  1.040572 2.919679 0.00089
O  -1.540118 1.022511 0.00023
O  3.234317 0.636329 0.000338
O  -3.830709 1.326864 -0.000276
C  -0.563454 -1.230085 -0.00022
C  -0.420684 0.196015 0.000098
C  0.853819 0.803234 0.000309
C  0.609187 -2.028308 -0.000331
C  2.011677 -0.022566 0.000167
C  1.88118 -1.443069 -0.000144
C  -1.901319 -1.775762 -0.000486
C  -3.014183 -0.964187 -0.000387
C  -2.91034 0.491491 0.00026
C  4.465863 -0.167893 0.00024
H  0.509722 -3.119431 -0.00058
H  2.771938 -2.075936 -0.000252
H  -2.020439 -2.865659 -0.000846
H  -4.029679 -1.366952 -0.000675
H  5.27808 0.57208 0.000433
H  4.529833 -0.797042 -0.90717
H  4.529736 -0.797413 0.907402
