program: Gaussian 09
title: 000149295
version: EM64L-G09RevD.01
frameworkgroup: C1[X(C12H16N2O5)]
method: RPBEPBE
basis: SDD
operation: Freq
keyword: #p
keyword: freq=noraman
keyword: PBEPBE/SDD
title: #p freq=noraman PBEPBE/SDD
converged: YES YES NO NO
title: Mulliken charges:
elementType: O O O O O N N C C C C C C C C C C C C H H H H H H H H H H H H H H H H
charge: -0.256142 -0.428764 -0.445499 -0.272512 -0.255501 -0.188194 -0.404117 -0.129929 -0.006631 -0.547062 -0.045243 -0.376702 -0.225022 0.184678 0.212345 0.085058 -0.265508 -0.182544 -0.742294 0.214914 0.286668 0.240720 0.284683 0.288335 0.214158 0.216534 0.341462 0.327906 0.358731 0.356700 0.258152 0.226037 0.215874 0.227863 0.230845
chargesum: 0.00000
title: Mulliken charges with hydrogens summed into heavy atoms:
elementType: O O O O O N N C C C C C C C C C C C C
charge: -0.256142 -0.087301 -0.088799 -0.272512 -0.255501 -0.188194 -0.045387 0.084985 0.280037 -0.021659 0.243092 0.053990 0.102884 0.184678 0.212345 0.085058 -0.007356 0.043493 -0.067713
polarizability: 2.15439522e+02 2.71848176e+01 1.93480305e+02 7.10468165e+00 -5.49521979e+00 9.67352683e+01
1716.lowfreq: -13.5147 -0.0003 0.0003 0.0006 1.9600 6.2121 30.3785 44.3975 56.9294
frequency: 29.6453 44.2563 56.8604 73.0784 87.2768 104.0895 107.9101 138.5819 156.6202 175.8927 185.4771 192.0790 202.8488 256.4072 281.5479 287.2527 298.7988 316.4584 327.2767 340.4583 355.2805 401.4741 416.7939 432.0472 458.8794 502.8507 540.3715 569.0579 628.4103 668.6474 703.7541 721.7474 723.6865 749.2283 762.9572 778.9869 805.6374 830.1451 855.9261 863.2556 935.5612 940.8850 947.2353 956.3587 969.6040 987.4461 1004.3464 1036.2095 1042.4194 1046.5872 1053.9731 1074.5774 1092.1532 1107.0326 1133.8617 1160.7312 1179.5128 1201.3549 1208.8067 1231.7537 1250.7965 1256.3089 1272.3071 1288.6319 1296.2312 1310.2354 1314.1458 1335.7095 1343.3147 1365.0045 1370.2165 1382.0688 1394.9780 1413.0513 1417.2258 1454.4449 1459.5568 1470.2524 1470.8076 1597.2881 1623.8515 1645.9318 1666.5608 2939.9496 2959.8652 2973.0952 2994.2568 3029.1515 3037.5593 3065.8305 3069.7526 3089.7692 3096.2796 3108.0154 3116.4006 3153.7537 3526.1774 3570.7680 3573.1043
redmass: 4.3818 5.2204 4.6076 3.6703 4.2130 4.3293 2.0127 3.9302 4.3163 2.8068 4.1963 1.8151 3.7626 4.1044 1.2272 1.2179 3.6998 4.9635 5.7253 4.5845 4.0444 7.0713 8.5043 3.4781 2.7239 3.0495 4.6140 6.7090 4.9483 4.0304 2.5653 3.5131 5.0020 8.1075 4.2954 2.0623 3.4085 1.9085 2.7399 3.0544 2.8827 1.8950 1.9903 1.8787 3.6425 1.9946 1.1252 3.6354 1.5286 2.9145 2.9837 2.3115 3.1933 2.4369 4.5852 1.2139 1.3083 1.1577 3.6442 1.2875 1.2359 1.4510 1.7153 1.4005 1.4178 1.4321 1.5371 1.2442 1.5440 1.5975 1.9277 1.5392 1.2544 3.3465 1.5285 1.0902 1.0481 1.0742 1.0780 5.2176 11.9818 5.6698 5.5385 1.0555 1.0373 1.0854 1.1051 1.0963 1.0641 1.0884 1.0927 1.0973 1.0885 1.1018 1.0883 1.0939 1.0769 1.0663 1.0666
irintensity: 4.3165 1.5699 0.3172 4.4550 0.2627 0.4638 4.1977 6.6188 5.4340 5.3081 7.0638 3.1913 10.2927 0.8596 101.7676 222.4555 19.5145 8.3087 30.4554 3.1624 0.7819 7.6613 1.4313 2.1219 3.9049 24.0937 35.8130 19.4173 2.9653 5.0662 7.0243 23.7655 10.5181 7.6746 3.6668 87.0217 17.8036 20.0249 3.4067 10.3650 52.2459 14.4313 36.4344 7.5139 65.8414 28.1188 59.5444 104.2712 1.3530 48.2517 36.5269 16.1234 23.7605 15.7104 5.9965 43.8330 2.9379 23.9116 6.7784 1.9094 3.4094 17.0302 266.0990 8.2934 5.6722 33.9557 17.7359 1.7507 68.9447 1.7066 29.0416 1.9673 4.9683 100.8113 10.3166 13.8295 15.0900 11.9724 6.8801 37.6854 321.1354 758.3931 17.0235 34.2549 50.7426 52.6634 64.4902 27.0441 12.6204 8.5722 1.8322 36.1704 12.6293 14.2956 20.5419 31.9460 58.5788 9.4786 6.7447
temp: 298.150 k
press: 1.00000 atm
elementType: 8 8 8 8 8 7 7 6 6 6 6 6 6 6 6 6 6 6 6 1 1 1 1 1 1 1 1 1 1 1 1 1 1 1 1
symmnumber: 1
zpe: 720421.2 jmol-1
zpe.correction: 0.274394 hartree
zpe.thermalcorrener: 0.293322 hartree
zpe.thermalcorrenthalpy: 0.294267 hartree
zpe.thermalcorrgfe: 0.226754 hartree
zpe.sumelectzpe: -951.048496 hartree
zpe.sumelectthermal: -951.029568 hartree
zpe.sumelectthermalent: -951.028624 hartree
zpe.sumelectthermalfe: -951.096136 hartree
dipole: -3.8365 3.3838 3.6829
dipole: 6.3034
quadrupole: -116.2373 -112.9197 -111.6531
quadrupole: 12.5740 -11.8818 8.1884
quadrupole: -2.6339 0.6837 1.9503 12.5740 -11.8818 8.1884
hfenergy: -951.3228903 hartree
pointgroup: C01[X(C12H16N2O5)]
dipole: 1.8109284 -1.0460097 1.3328751 debye
polarizability: 201.8161848|30.0037812|205.7051706|-9.1439552|10.0897611|98.1337399 unknown
InChI: InChI=1S/C12H16N2O5/c1-2-3-7-5-14(12(18)13-11(7)17)10-4-8(16)9(6-15)19-10/h2-3,5,8-10,13,15-16H,4,6H2,1H3
charge 0 multiplicity 1
35 atoms
O  1.911661 -0.364645 -1.031955
O  4.68815 0.554599 -0.270117
O  1.378257 -2.894682 0.165642
O  0.19055 3.243122 0.198429
O  -3.905113 1.083223 0.879125
N  0.071914 0.924855 -0.153031
N  -1.845478 2.109152 0.517141
C  3.566661 0.191287 0.603692
C  1.534818 0.946907 -0.543576
C  2.46358 1.279063 0.658646
C  2.862979 -0.997344 -0.078496
C  2.156191 -1.913224 0.931923
C  -0.678685 -0.245987 -0.195471
C  -0.487736 2.173313 0.187029
C  -2.02324 -0.294265 0.135608
C  -2.692706 0.958512 0.538121
C  -2.845745 -1.514749 0.10825
C  -2.4552 -2.763098 -0.28194
C  -3.365941 -3.967701 -0.294254
H  3.935451 -0.063774 1.619365
H  1.633455 1.671502 -1.367876
H  1.898709 1.216574 1.604927
H  2.862896 2.302052 0.578765
H  3.561074 -1.578164 -0.701171
H  1.493743 -1.328224 1.605915
H  2.93549 -2.412756 1.546416
H  5.066957 1.420977 0.024184
H  -0.116366 -1.1281 -0.515611
H  -2.285556 2.998781 0.773262
H  0.996312 -3.566682 0.784299
H  -3.881521 -1.353876 0.436902
H  -1.425098 -2.93302 -0.632833
H  -2.973374 -4.780401 0.349562
H  -3.453028 -4.390765 -1.314769
H  -4.380264 -3.71176 0.058293
