program: Gaussian 09
title: 000149284
version: EM64L-G09RevD.01
frameworkgroup: C1[X(C10H10N4O2)]
method: RPBEPBE
basis: SDD
operation: Freq
keyword: #p
keyword: freq=noraman
keyword: PBEPBE/SDD
title: #p freq=noraman PBEPBE/SDD
converged: YES YES NO NO
title: Mulliken charges:
elementType: O O N N N N C C C C C C C C C C H H H H H H H H H H
charge: -0.285647 -0.309297 -0.369291 -0.437978 -0.126653 -0.302884 0.225847 0.150750 0.166064 -0.337024 -0.349480 0.140947 -0.236283 -0.219595 0.274099 -0.758590 0.221576 0.282182 0.238297 0.357167 0.240671 0.342929 0.360053 0.218336 0.256786 0.257018
chargesum: 0.00000
title: Mulliken charges with hydrogens summed into heavy atoms:
elementType: O O N N N N C C C C C C C C C C
charge: -0.285647 -0.309297 -0.012124 -0.095050 -0.126653 0.057169 0.225847 0.150750 0.166064 -0.115448 -0.067298 0.140947 0.002014 0.021076 0.274099 -0.026449
polarizability: 2.36491972e+02 -5.09776486e+00 1.70316732e+02 1.76380416e-01 1.29396778e-02 6.13730637e+01
1716.lowfreq: -7.7186 -4.3893 -0.0004 0.0004 0.0005 5.6695 24.5586 66.7485 75.6185
frequency: 24.4954 66.7358 75.6169 101.0750 111.1278 124.5432 190.7174 223.3871 227.4712 270.9585 303.2585 319.4991 394.6943 427.7844 447.3742 461.9190 464.9429 471.9101 544.4977 547.7524 611.9462 622.2472 632.8681 638.6093 650.7158 701.9069 720.0033 767.8032 779.8113 781.6837 828.6373 887.3720 950.6418 974.7258 985.5228 1010.5872 1021.0142 1043.0907 1046.9364 1081.6036 1140.0399 1179.5727 1180.8061 1223.0074 1245.5938 1264.5386 1291.8824 1335.0745 1392.6801 1393.0179 1398.0525 1441.9109 1443.2126 1448.5754 1469.0441 1489.8939 1511.1556 1566.9194 1571.0057 1596.3120 1618.0202 1630.3612 2999.1306 3097.1723 3103.8485 3133.0107 3145.7251 3159.8466 3173.2877 3505.5744 3540.9809 3553.3977
redmass: 6.8092 4.0321 5.2544 3.0599 1.4274 4.1950 4.4087 6.7084 5.5659 4.9202 6.5000 4.7758 2.3508 4.0436 2.6627 1.9299 5.9847 8.3205 7.0901 1.7392 2.7782 5.6877 5.6562 1.8818 2.3589 6.7846 1.5379 6.7509 3.6392 1.5443 5.8429 1.4953 2.8831 1.3829 2.1471 1.3504 3.5531 1.5704 2.4713 3.3430 1.9365 1.4551 2.3038 2.5128 1.7378 2.0297 3.1028 1.9177 9.9941 1.6582 1.2328 2.3711 2.1098 1.0442 1.3170 2.3359 5.0725 3.5491 4.8765 7.1694 6.8647 6.3719 1.0359 1.0982 1.1008 1.0865 1.0898 1.0946 1.1002 1.0806 1.0789 1.0786
irintensity: 0.8324 9.1759 9.5710 2.0755 0.1513 1.2463 0.2084 0.5366 10.8195 0.2303 6.7494 13.8651 10.8256 4.0362 34.1885 53.3964 15.6395 8.0036 6.6228 73.8665 0.3153 4.3068 7.3280 2.0610 24.2482 5.7489 179.3330 26.2887 11.6364 56.0696 4.7819 0.4114 4.6102 2.3743 11.7120 0.7022 7.7619 14.9984 4.7198 0.9517 86.6359 1.0029 9.7597 48.5027 16.2055 64.0011 31.3530 142.4112 0.6839 12.1835 48.0072 442.9002 14.7551 16.0761 47.2079 265.8524 27.9994 52.7876 442.8501 33.5759 69.0542 113.3682 12.3921 7.3860 18.3824 2.8976 11.4988 6.6182 19.2268 38.6268 194.4352 55.9568
temp: 298.150 k
press: 1.00000 atm
elementType: 8 8 7 7 7 7 6 6 6 6 6 6 6 6 6 6 1 1 1 1 1 1 1 1 1 1
symmnumber: 1
zpe: 513079.2 jmol-1
zpe.correction: 0.195422 hartree
zpe.thermalcorrener: 0.209545 hartree
zpe.thermalcorrenthalpy: 0.210489 hartree
zpe.thermalcorrgfe: 0.153389 hartree
zpe.sumelectzpe: -755.369870 hartree
zpe.sumelectthermal: -755.355747 hartree
zpe.sumelectthermalent: -755.354802 hartree
zpe.sumelectthermalfe: -755.411902 hartree
dipole: -1.7721 0.7860 -0.0128
dipole: 1.9387
quadrupole: -94.7863 -89.7374 -95.8330
quadrupole: 27.9934 0.0391 -0.0058
quadrupole: -1.3341 3.7148 -2.3807 27.9934 0.0391 -0.0058
hfenergy: -755.5652916 hartree
pointgroup: C01 [X(C10H10N4O2)]
dipole: 0.6921055 -0.319752 -0.0223894 debye
dipolederiv: -1.2314078 0.4933818 0.0252092 0.516633 -0.8642575 -0.01664 0.0265831 -0.0158841 -0.3756571 -0.7198881 -0.0746397 0.0072778 0.7076281 -1.0359695 -0.0098791 0.0029923 0.0042157 -0.3890371 -1.3206698 0.406913 0.0233428 0.6597448 -0.4153809 -0.0248099 0.0433745 -0.0246446 -0.3143135 -0.8348574 0.6231937 0.0156821 -0.6173185 -0.127332 0.0167167 0.0115182 -0.0149892 -0.3212773 -0.086253 -0.6863929 -0.0050354 0.7970471 -0.2766557 -0.0204505 0.000118 0.0178374 -0.1950515 -0.9520802 0.3532872 0.0160035 0.7120244 -0.4659959 -0.0076291 0.001607 0.0003358 -0.2660908 -0.124683 0.0926426 0.0055502 0.0536717 0.136219 -0.0003635 0.006325 -0.0015946 0.0623186 0.0048912 0.0442424 0.0005925 0.0899354 -0.3099805 -0.0047665 0.000631 -0.0039754 0.0176558 1.3617906 -0.4105364 -0.0335797 -1.2706675 0.50308 0.0354224 -0.0404855 0.0172944 0.149995 -0.0512186 -0.1239239 -0.0046324 -0.1147976 -0.1328274 0.0035563 -0.0053469 0.0033907 -0.1526167 0.0115906 -0.0088038 -0.0035522 -0.2067414 -0.0409668 0.0060518 -0.0044818 0.000686 -0.1068826 1.6325329 -0.6329305 -0.0417957 -0.0817432 0.8987731 0.0068388 -0.0409284 0.0211356 0.2154078 -0.0090702 0.0042959 -0.0033308 0.0057894 0.1741039 0.002279 -0.0031221 0.0023287 -0.1295775 0.0741342 0.0781761 -0.0060331 0.1506439 -0.0532105 -0.0035674 -0.0052816 -0.0017221 -0.1489639 1.6760428 -0.2348361 -0.0256344 -1.0062444 1.2787296 0.0125056 -0.0205985 -0.0029733 0.1850831 -0.3268023 -0.1650928 0.0072395 -0.120057 -0.0621177 0.0021024 0.0085332 0.0034198 0.0150788 -0.0603501 0.0981571 0.0067611 0.0683385 0.0556722 -0.0024982 0.0065098 -0.0036264 0.1544722 0.0388652 0.0186497 0.0034189 0.0902691 0.0888166 -0.0029689 0.0038327 -0.000869 0.1563613 0.0886105 -0.0032287 0.0019518 -0.0263601 -0.1056936 -0.001269 0.0017548 -0.001824 0.1575418 0.3325278 0.0230075 0.00006 -0.1934648 0.2286712 0.0058107 -0.0034842 0.0065986 0.3401013 -0.0626896 -0.0882805 0.0056827 -0.0873314 0.0416032 0.0016382 0.0056827 0.0017305 0.160264 0.1346352 0.0458353 0.0055494 0.0122045 0.2255092 -0.0009258 0.0051383 -0.0021707 0.3368778 0.3270869 0.0488424 -0.000797 -0.1090487 0.2090742 0.0017582 -0.0006538 -0.0031274 0.3412255 0.0560386 0.0806599 0.0006075 -0.0128045 -0.1258917 0.0011808 0.0009591 -0.0005413 0.1218597 0.017912 0.0089381 -0.0755304 -0.0079368 0.0882467 0.0567446 -0.1249046 0.0285788 -0.0044122 0.0233119 0.0084428 0.0749923 -0.0094142 0.0877811 -0.0568374 0.1237278 -0.0296099 -0.0103626 unknown
polarizability: 236.2202726|-6.0848255|170.4843745|-4.2282231|0.6126125|61.477121 unknown
InChI: InChI=1S/C10H10N4O2/c1-6(15)11-12-9-7-4-2-3-5-8(7)10(16)14-13-9/h2-5,11-12,14H,1H3
charge 0 multiplicity 1
26 atoms
O  -3.099882 2.48404 0.042107
O  3.973267 -1.578739 -0.130766
N  1.59615 -0.384268 -0.102375
N  -0.782917 2.278565 -0.024877
N  0.438624 1.608409 -0.059272
N  2.770444 0.376304 -0.124524
C  -0.87358 -0.49729 -0.036206
C  -2.092758 0.249263 0.00236
C  0.378098 0.264614 -0.064712
C  -0.933689 -1.919165 -0.044941
C  -3.339676 -0.421857 0.032977
C  -2.072687 1.734785 0.009472
C  -2.177609 -2.574078 -0.014468
C  -3.384928 -1.82659 0.025044
C  3.971863 -0.301571 -0.137437
C  5.219183 0.558993 -0.160994
H  -0.019624 -2.522258 -0.076624
H  -4.247397 0.189318 0.062252
H  -2.214309 -3.668612 -0.021546
H  1.773879 -1.391145 -0.091145
H  -4.347837 -2.347166 0.048815
H  -0.701187 3.297332 -0.022948
H  2.609478 1.388612 -0.117458
H  4.996903 1.639783 -0.161575
H  5.842008 0.32281 0.719001
H  5.813084 0.316611 -1.059158
